program: Gaussian 09
title: 000143853
version: EM64L-G09RevD.01
frameworkgroup: C1[X(C13H14)]
method: RPBEPBE
basis: SDD
operation: Freq
keyword: #p
keyword: freq=noraman
keyword: PBEPBE/SDD
title: #p freq=noraman PBEPBE/SDD
converged: YES YES NO NO
title: Mulliken charges:
elementType: C C C C C C C C C C C C C H H H H H H H H H H H H H H
charge: 0.071092 0.386019 0.412322 0.354121 -0.574203 -0.434448 -0.452689 -0.450708 -0.440235 -0.261756 -0.867327 -0.254242 -0.691032 0.219050 0.234836 0.225982 0.237490 0.237249 0.223909 0.226635 0.241024 0.230120 0.233139 0.227578 0.221535 0.216874 0.227669
chargesum: 0.00000
title: Mulliken charges with hydrogens summed into heavy atoms:
elementType: C C C C C C C C C C C C C
charge: 0.071092 0.386019 0.412322 0.354121 -0.120318 -0.208467 -0.215200 -0.213459 -0.216326 -0.035121 -0.163044 -0.026664 -0.024954
polarizability: 1.76807595e+02 -1.05398784e+01 1.70463338e+02 9.88437985e+00 1.30964869e+00 7.29238894e+01
1716.lowfreq: -0.0005 -0.0005 0.0002 2.6687 9.0628 14.3346 49.4869 119.6208 151.0334
frequency: 49.3658 119.6031 151.0304 172.9175 207.0418 238.8677 290.3924 310.1065 321.6589 352.3949 457.5808 475.3683 475.6642 496.2068 517.6890 548.9034 594.6835 609.6242 659.6328 764.4943 777.2220 783.6212 786.7346 796.5965 839.4130 899.9015 921.0954 923.1265 974.9878 976.1403 987.0481 1004.7066 1042.7012 1046.7379 1058.0158 1074.9017 1121.7793 1123.0108 1174.2310 1175.3412 1231.0026 1246.6234 1251.1414 1267.2068 1312.8951 1369.9887 1383.5459 1386.1305 1388.9412 1403.8623 1426.9218 1455.9072 1467.5292 1474.4326 1479.6407 1492.1226 1517.9819 1522.8827 1590.0952 1604.3305 1621.7110 2978.2400 2982.8063 3006.7781 3065.6849 3071.8184 3077.4737 3082.3352 3104.6886 3114.2495 3118.1859 3124.1983 3127.3767 3154.2089 3156.2138
redmass: 3.2168 2.8530 2.8486 3.2808 1.1628 2.8829 1.1944 2.4092 3.1819 2.7300 4.0581 3.8707 3.8524 3.5048 3.4724 5.8311 3.7016 3.3599 3.0071 1.2274 3.0250 2.8620 2.1295 1.4587 2.1957 1.3451 2.4385 1.5187 1.3435 2.1213 1.3914 2.3829 1.8791 1.9248 2.0265 1.9525 1.9102 1.6512 1.2633 1.2135 1.4993 1.4985 1.7682 2.1604 1.5267 2.7311 2.6710 1.2907 3.8571 1.2636 1.9808 2.4524 1.0435 1.0870 1.0595 1.0547 1.3867 2.4741 6.4376 5.7452 6.1690 1.0351 1.0380 1.0706 1.0963 1.0978 1.0981 1.0989 1.0926 1.0869 1.0858 1.0908 1.0907 1.0998 1.0996
irintensity: 0.0403 0.1495 0.3195 2.0697 0.1922 4.2557 1.1288 6.1650 0.9720 1.3721 0.0989 0.0260 0.0789 0.4184 0.5083 1.0114 1.1814 0.5884 0.4542 0.4141 1.8356 34.1193 43.8132 7.7528 47.8887 1.2722 8.6019 2.0504 0.1111 0.1256 2.6801 2.1065 5.9544 5.6589 13.3278 2.3588 7.6708 4.5686 0.7237 5.3120 0.1865 0.3662 3.2410 3.0842 0.7893 4.3023 5.3190 10.5317 4.9723 10.5828 2.5313 0.7236 16.6725 17.9118 7.2221 15.4082 8.3146 4.1239 17.1295 1.7747 1.1522 42.1969 29.3699 32.8759 19.2332 14.9614 53.5369 26.6922 27.9094 10.6023 3.6794 12.4797 29.1059 50.3879 24.0926
temp: 298.150 k
press: 1.00000 atm
elementType: 6 6 6 6 6 6 6 6 6 6 6 6 6 1 1 1 1 1 1 1 1 1 1 1 1 1 1
symmnumber: 1
zpe: 600284.2 jmol-1
zpe.correction: 0.228636 hartree
zpe.thermalcorrener: 0.239868 hartree
zpe.thermalcorrenthalpy: 0.240813 hartree
zpe.thermalcorrgfe: 0.191991 hartree
zpe.sumelectzpe: -502.862032 hartree
zpe.sumelectthermal: -502.850800 hartree
zpe.sumelectthermalent: -502.849856 hartree
zpe.sumelectthermalfe: -502.898677 hartree
dipole: -0.5508 -0.5030 -0.0126
dipole: 0.7460
quadrupole: -69.9203 -69.7075 -83.0462
quadrupole: 0.1878 1.7641 1.1153
quadrupole: 4.3043 4.5172 -8.8215 0.1878 1.7641 1.1153
hfenergy: -503.0906682 hartree
pointgroup: C01 [X(C13H14)]
dipole: -0.1955906 -0.2187641 -0.0061379 debye
polarizability: 178.7663425|-9.710305|168.4060794|10.1869735|2.362895|73.0224003 unknown
InChI: InChI=1S/C13H14/c1-3-11-7-5-9-12-8-4-6-10(2)13(11)12/h4-9H,3H2,1-2H3
charge 0 multiplicity 1
27 atoms
C  0.058596 -0.121918 -0.135447
C  -1.365339 0.150274 -0.299022
C  0.936418 1.03106 0.073414
C  0.690692 -1.437475 -0.170378
C  -2.473718 -0.902582 -0.35634
C  -1.811836 1.483999 -0.314575
C  0.414982 2.366082 0.061858
C  2.342651 0.857527 0.291731
C  2.073851 -1.54197 0.057673
C  -0.94078 2.596724 -0.145111
C  -0.023474 -2.743692 -0.498729
C  2.907441 -0.412538 0.300271
C  -2.894507 -1.38699 1.058784
H  -3.358046 -0.444148 -0.838121
H  -2.205277 -1.768022 -0.979186
H  -2.884738 1.670051 -0.448785
H  1.109905 3.200123 0.216367
H  2.960835 1.749063 0.450591
H  2.53244 -2.537702 0.032433
H  -1.342237 3.615576 -0.167112
H  -0.843102 -2.980553 0.20064
H  -0.445695 -2.73372 -1.520668
H  0.696441 -3.57896 -0.454808
H  3.979899 -0.55208 0.473656
H  -2.044348 -1.831255 1.60726
H  -3.697759 -2.144385 0.993568
H  -3.266799 -0.539191 1.661935
