program: Gaussian 09
title: 000143849
version: EM64L-G09RevD.01
frameworkgroup: C1[X(C11H24)]
method: RPBEPBE
basis: SDD
operation: Freq
keyword: #p
keyword: freq=noraman
keyword: PBEPBE/SDD
title: #p freq=noraman PBEPBE/SDD
converged: YES YES NO NO
title: Mulliken charges:
elementType: C C C C C C C C C C C H H H H H H H H H H H H H H H H H H H H H H H H
charge: 0.374452 -0.460067 0.340768 -0.440651 -0.390958 -0.753697 -0.749265 -0.734813 -0.728663 -0.735875 -0.731084 0.206827 0.201946 0.203131 0.203760 0.189174 0.200213 0.212864 0.208569 0.208593 0.215062 0.206718 0.208888 0.207189 0.215909 0.206919 0.208803 0.208629 0.208954 0.208869 0.206364 0.217194 0.220148 0.212751 0.222377
chargesum: 0.00000
title: Mulliken charges with hydrogens summed into heavy atoms:
elementType: C C C C C C C C C C C
charge: 0.374452 -0.051294 0.340768 -0.033759 -0.001571 -0.123671 -0.118597 -0.104797 -0.102276 -0.103447 -0.075808
polarizability: 1.32322635e+02 -2.91585558e-01 1.16079599e+02 -1.24336073e+00 -1.47249390e-01 1.08857225e+02
1716.lowfreq: -11.4710 -2.9212 -0.0003 0.0003 0.0007 12.0811 18.8161 55.9279 95.8517
frequency: 11.1980 55.8827 95.8286 128.2555 133.9263 196.0762 199.2835 206.9704 234.1337 246.3899 252.5425 261.2535 266.8943 290.8993 315.0264 325.8380 351.0542 380.5794 401.9022 422.8803 466.6327 472.4347 490.1401 708.8259 740.8400 752.8536 778.4384 877.0373 906.2799 914.3279 924.2310 926.5676 931.0609 936.3226 954.3326 984.5811 1012.2029 1015.7512 1019.1295 1058.1730 1069.0381 1078.6158 1125.0946 1179.0165 1208.8879 1216.4473 1236.7479 1254.8199 1274.1530 1286.9325 1303.5015 1318.9325 1337.5915 1353.6266 1368.8127 1372.4326 1372.7797 1389.2735 1393.3737 1396.4667 1450.4796 1456.9277 1458.9375 1463.9123 1466.4122 1468.2628 1470.6884 1473.7458 1478.0574 1482.2683 1483.1221 1486.2254 1489.0506 1493.5554 1496.7855 2955.4856 2960.4267 2963.0458 2963.8274 2964.3556 2967.1819 2969.9346 2972.0132 2978.8861 3003.4695 3012.2074 3031.9731 3055.1013 3055.1880 3057.2483 3059.0331 3061.4449 3064.1756 3065.1233 3066.5707 3067.5520 3069.2173 3071.6375 3075.8896
redmass: 2.7426 2.7705 2.0048 2.3114 1.6729 1.1502 1.4620 1.3150 1.3692 1.2916 1.0681 1.2426 1.4125 2.4251 1.9660 2.1617 2.3380 2.3270 2.1172 2.0901 2.5787 2.4766 2.3747 3.2422 2.2512 1.3976 1.2632 2.0218 2.2120 1.9239 1.7224 1.6064 1.4908 1.2251 1.4205 1.3042 1.4453 1.4843 1.3978 2.5498 1.5493 2.5245 1.3908 2.0697 2.2714 2.2716 2.4844 3.0507 1.7202 1.4351 1.5153 1.2729 1.5211 1.4790 1.2085 1.2052 1.2055 1.2210 1.2011 1.2123 1.0709 1.0512 1.0603 1.0548 1.0470 1.0581 1.0578 1.0643 1.0588 1.0567 1.0599 1.0585 1.0600 1.0595 1.0623 1.0566 1.0358 1.0527 1.0362 1.0350 1.0505 1.0430 1.0426 1.0377 1.0985 1.0995 1.1029 1.1000 1.0996 1.0997 1.0994 1.0987 1.0994 1.0983 1.0989 1.0985 1.0982 1.0980 1.0993
irintensity: 0.0018 0.0002 0.0026 0.0629 0.0189 0.0087 0.0148 0.0104 0.0197 0.0004 0.0018 0.0247 0.0582 0.0950 0.0171 0.0492 0.0149 0.0121 0.0138 0.1378 1.3518 1.9185 0.1085 0.4232 1.2118 4.4982 8.5550 0.4406 4.4989 3.3900 1.0247 1.3506 1.4820 0.0522 0.1226 1.5306 13.0399 1.4632 0.8460 0.9139 1.8731 1.0326 4.5572 3.1563 1.6164 1.9856 15.8572 14.4388 6.8289 0.8920 19.9746 0.5386 1.3410 0.1437 26.6526 23.7596 16.3815 30.8961 12.2389 9.0570 0.1586 0.1110 1.6273 0.3330 2.1098 0.4933 0.8411 13.2558 8.8438 6.9782 12.3676 14.2293 7.1431 4.7683 39.8851 3.4637 32.2830 28.4417 18.8774 50.9087 84.6594 30.4870 16.5987 22.6136 1.9474 23.9427 50.4876 0.3787 3.9227 0.6287 18.5014 135.1011 7.3777 110.8830 27.6344 61.9208 89.3331 69.9852 61.1253
temp: 298.150 k
press: 1.00000 atm
elementType: 6 6 6 6 6 6 6 6 6 6 6 1 1 1 1 1 1 1 1 1 1 1 1 1 1 1 1 1 1 1 1 1 1 1 1
symmnumber: 1
zpe: 848229.8 jmol-1
zpe.correction: 0.323074 hartree
zpe.thermalcorrener: 0.338381 hartree
zpe.thermalcorrenthalpy: 0.339325 hartree
zpe.thermalcorrgfe: 0.281180 hartree
zpe.sumelectzpe: -432.624405 hartree
zpe.sumelectthermal: -432.609098 hartree
zpe.sumelectthermalent: -432.608154 hartree
zpe.sumelectthermalfe: -432.666298 hartree
dipole: 0.0142 0.0000 0.0600
dipole: 0.0616
quadrupole: -74.2709 -74.5908 -74.6712
quadrupole: 0.1733 0.3549 0.2653
quadrupole: 0.2401 -0.0798 -0.1602 0.1733 0.3549 0.2653
hfenergy: -432.9474786 hartree
pointgroup: C01 [X(C11H24)]
dipole: 0.0054734 0.0004197 -0.0236131 debye
polarizability: 132.3198452|0.5579494|116.0969173|1.1317597|-0.0242524|108.8426967 unknown
InChI: InChI=1S/C11H24/c1-7-11(5,6)9-8-10(2,3)4/h7-9H2,1-6H3
charge 0 multiplicity 1
35 atoms
C  1.793952 0.499086 0.006533
C  0.333432 0.352023 0.548999
C  -2.219364 -0.066029 0.027394
C  -0.759924 0.094726 -0.512926
C  2.254987 -0.758835 -0.799632
C  2.73494 0.724488 1.222401
C  1.903313 1.736577 -0.926563
C  -2.326979 -1.288175 0.978642
C  -3.154708 -0.298659 -1.191227
C  -2.680811 1.214721 0.772967
C  2.169818 -2.113415 -0.061913
H  0.321345 -0.46722 1.294673
H  0.093204 1.280447 1.106464
H  -0.509986 -0.824923 -1.081397
H  -0.761062 0.926275 -1.247027
H  3.304084 -0.587486 -1.118924
H  1.660563 -0.820499 -1.733445
H  2.671844 -0.106582 1.949093
H  3.789357 0.813457 0.897362
H  2.466187 1.655303 1.757712
H  1.296942 1.613453 -1.842672
H  2.952668 1.895455 -1.240698
H  1.560926 2.65434 -0.411195
H  -3.376562 -1.443605 1.292687
H  -1.722148 -1.150057 1.893234
H  -1.982722 -2.213013 0.476647
H  -4.205171 -0.425852 -0.867069
H  -2.859923 -1.206789 -1.751475
H  -3.116753 0.558532 -1.89058
H  -2.581583 2.107324 0.125857
H  -3.742742 1.128551 1.071829
H  -2.089426 1.391144 1.689796
H  2.777601 -2.117655 0.861141
H  2.542615 -2.930316 -0.707389
H  1.129385 -2.360992 0.218302
