program: Gaussian 09
title: 000143777
version: EM64L-G09RevD.01
frameworkgroup: C1[X(C2H4O2)]
method: RPBEPBE
basis: SDD
operation: Freq
keyword: #p
keyword: freq=noraman
keyword: PBEPBE/SDD
title: #p freq=noraman PBEPBE/SDD
converged: NO NO NO NO
title: Mulliken charges:
elementType: O O C C H H H H
charge: -0.304003 -0.303987 -0.141939 -0.141941 0.222867 0.223065 0.223067 0.222870
chargesum: 0.00000
title: Mulliken charges with hydrogens summed into heavy atoms:
elementType: O O C C
charge: -0.304003 -0.303987 0.303993 0.303996
polarizability: 3.45103967e+01 1.09251505e-05 2.14648460e+01 -7.21410968e-06 -1.03022108e-06 2.18030651e+01
1716.lowfreq: -30.4558 -20.7632 -0.0011 -0.0011 0.0006 9.5538 119.5757 793.1838 798.4489
frequency: 119.5757 793.1838 798.4489 917.4968 945.1254 954.5434 1009.4208 1036.5072 1046.8955 1086.4758 1265.8619 1350.6710 1485.7666 1516.5890 2970.5190 2985.1576 3045.8153 3052.1237
redmass: 2.3029 9.5507 4.6927 12.9026 1.0937 8.9215 5.7363 1.0078 1.3159 1.4929 1.1730 1.2631 1.0734 1.1054 1.0489 1.0563 1.1143 1.1199
irintensity: 35.3418 0.0001 75.0204 0.0002 0.0005 159.7411 0.0008 0.0000 0.0018 5.1117 0.0000 0.7982 3.4640 0.0000 213.8266 0.0182 0.0121 123.5583
temp: 298.150 k
press: 1.00000 atm
elementType: 8 8 6 6 1 1 1 1
symmnumber: 1
zpe: 157788.5 jmol-1
zpe.correction: 0.060098 hartree
zpe.thermalcorrener: 0.064084 hartree
zpe.thermalcorrenthalpy: 0.065028 hartree
zpe.thermalcorrgfe: 0.033817 hartree
zpe.sumelectzpe: -228.651485 hartree
zpe.sumelectthermal: -228.647499 hartree
zpe.sumelectthermalent: -228.646555 hartree
zpe.sumelectthermalfe: -228.677767 hartree
dipole: 0.0000 -0.0001 0.0090
dipole: 0.0090
quadrupole: -17.5809 -30.5965 -22.7277
quadrupole: 0.0000 0.0000 0.0000
quadrupole: 6.0542 -6.9615 0.9073 0.0000 0.0000 0.0000
hfenergy: -228.7115836 hartree
pointgroup: C01 [X(C2H4O2)]
dipole: 0.0000125 -0.0000446 0.0035462 debye
dipolederiv: -0.7652854 -0.0000088 0.0000002 -0.0000144 -0.5388023 0.0004236 0. -0.000514 -0.3976118 -0.7653358 -0.0000076 0.0000002 -0.0000031 -0.5388138 -0.0004237 0. 0.000514 -0.3976125 0.9713796 -0.0000063 -0.0008651 0.0000082 0.4551467 0. -0.0008966 0. 0.6070764 0.9713642 0.0000437 0.0008643 0.0000297 0.4551454 0. 0.0008959 0. 0.607067 -0.1027632 -0.0000039 0.1047385 -0.0000081 0.0413773 0.000005 0.1698198 0.0000051 -0.1055949 -0.1033022 -0.000004 -0.1047215 -0.0000081 0.0422836 -0.000005 -0.1693369 -0.0000051 -0.1038701 -0.1032983 -0.0000065 0.1047186 -0.0000021 0.0422847 0.0000025 0.1693336 0.0000073 -0.1038649 -0.102759 -0.0000065 -0.1047352 -0.0000021 0.0413784 -0.0000025 -0.169816 -0.0000074 -0.1055893 unknown
polarizability: 34.5103967|0.0004636|21.464846|-0.0000072|-0.000001|21.8030651 unknown
InChI: InChI=1S/C2H4O2/c1-3-2-4-1/h1-2H2
charge 0 multiplicity 1
8 atoms
O  -0.000053 1.07864 -0.000541
O  0.000026 -1.07866 -0.000541
C  -1.03212 -0.00007 0.001498
C  1.0321 0.000005 0.001498
H  -1.647785 -0.000088 0.921416
H  -1.651851 -0.000088 -0.915572
H  1.651824 0.000031 -0.915573
H  1.647758 0.000031 0.921416
