program: Gaussian 09
title: 000143708
version: EM64L-G09RevD.01
frameworkgroup: C1[X(C11H12O2)]
method: RPBEPBE
basis: SDD
operation: Freq
keyword: #pfreq=noraman
keyword: PBEPBE/SDD
title: #p freq=noraman PBEPBE/SDD
converged: NO YES NO NO
title: Mulliken charges:
elementType: O O C C C C C C C C C C C H H H H H H H H H H H H
charge: -0.136828 -0.135563 0.346621 -0.434305 -0.422290 -0.512656 -0.503082 -0.438110 -0.431766 0.094047 0.069514 -0.206339 -0.200490 0.299958 0.300390 0.240817 0.226955 0.232468 0.219914 0.210061 0.229996 0.208587 0.228583 0.256845 0.256673
chargesum: 0.00000
title: Mulliken charges with hydrogens summed into heavy atoms:
elementType: O O C C C C C C C C C C C
charge: -0.136828 -0.135563 0.346621 -0.134347 -0.121900 -0.044883 -0.050701 0.001948 0.005404 0.094047 0.069514 0.050505 0.056183
polarizability: 1.18027802e+02 5.57798649e+00 1.10018028e+02 -4.53536433e-01 8.90876401e-02 1.05545498e+02
1716.lowfreq: -17.2641 -12.4060 -0.0007 -0.0004 -0.0003 14.5941 15.6272 101.2788 114.5951
frequency: 10.1735 101.2609 114.5860 160.7520 216.9275 264.4476 291.6382 323.2280 369.3213 408.4384 426.3551 476.8033 497.4863 548.6892 650.8479 666.1357 673.0785 709.9843 753.5273 797.2555 809.3711 827.7548 855.9462 873.8622 910.1364 913.3895 932.6185 945.8026 969.0039 981.0138 995.5479 1009.6647 1036.2111 1053.5643 1069.2416 1104.2327 1135.7084 1149.4146 1155.0527 1186.2847 1198.3212 1210.1912 1227.4318 1241.1310 1254.3937 1283.5868 1294.4436 1305.3394 1313.4348 1322.7158 1462.2729 1465.0310 1470.0992 1480.3288 1556.9638 1664.9895 1673.2632 2987.3209 2991.2018 2992.5187 2996.4437 3047.5452 3059.4038 3067.4896 3077.6149 3105.3355 3107.8674 3175.1124 3205.4681
redmass: 2.5068 7.4655 6.3310 2.7091 3.8408 1.6515 11.5812 2.7528 5.4578 3.5169 4.5322 3.8249 5.1772 1.9830 3.0932 3.4836 2.9066 5.6499 1.7481 3.4507 4.4392 1.8445 2.0972 1.8075 2.0135 2.1696 1.6321 2.6498 2.0778 2.5914 2.4111 2.3734 1.9932 1.5749 1.5502 1.6345 5.5013 1.5929 1.5841 1.5960 1.5758 1.4717 1.3891 1.4313 1.6616 1.4607 1.4521 1.2714 1.3467 1.5912 1.0823 1.0858 1.0823 1.1013 5.8709 12.4559 12.2482 1.0609 1.0648 1.0628 1.0659 1.1004 1.0975 1.1012 1.1036 1.0893 1.0930 1.0878 1.1091
irintensity: 0.2649 0.1304 2.6348 0.8105 0.7390 0.2608 3.7318 0.0060 1.2758 2.6701 4.6431 1.1371 5.5042 1.9288 2.6385 4.4143 1.6507 0.7041 98.9993 2.1221 0.9057 4.0157 4.5003 0.9484 6.6457 5.4784 0.6358 1.7779 6.9027 5.3709 0.9412 5.8383 20.1701 0.9111 0.2071 4.8717 14.5454 1.6461 3.2387 0.0471 8.7063 0.5713 0.6294 2.1490 12.4352 0.6562 1.7573 1.7994 1.3361 6.1918 4.4975 11.7810 10.4741 3.3997 3.3223 275.2856 95.5875 26.1522 29.6858 35.1353 15.2608 16.2909 30.1234 27.0114 50.3176 25.5737 2.5722 0.7460 10.4083
temp: 298.150 k
press: 1.00000 atm
elementType: 8 8 6 6 6 6 6 6 6 6 6 6 6 1 1 1 1 1 1 1 1 1 1 1 1
symmnumber: 1
zpe: 530017.6 jmol-1
zpe.correction: 0.201873 hartree
zpe.thermalcorrener: 0.212742 hartree
zpe.thermalcorrenthalpy: 0.213686 hartree
zpe.thermalcorrgfe: 0.163935 hartree
zpe.sumelectzpe: -575.806134 hartree
zpe.sumelectthermal: -575.795265 hartree
zpe.sumelectthermalent: -575.794321 hartree
zpe.sumelectthermalfe: -575.844072 hartree
dipole: 4.6139 3.3627 -0.3018
dipole: 5.7172
quadrupole: -86.4912 -75.7200 -77.7128
quadrupole: -10.6254 0.8912 -0.2234
quadrupole: -6.5165 4.2547 2.2618 -10.6254 0.8912 -0.2234
hfenergy: -576.0080069 hartree
pointgroup: C01 [X(C11H12O2)]
dipole: 1.8505455 -1.2748771 0.0983676 debye
dipolederiv: -0.6087461 0.2666332 -0.2653358 0.2719803 -0.4518305 0.1932955 -0.2779164 0.2146078 -0.6160695 -0.6163513 0.2996916 0.2226304 0.3018149 -0.5095373 -0.2067258 0.2330517 -0.2282189 -0.5514528 0.2253308 0.0445904 -0.003644 0.0968248 0.124605 -0.0104201 -0.014864 -0.0010738 -0.0009564 -0.2542379 0.0183898 -0.0375504 0.1084523 -0.2638875 0.1544967 -0.0454191 -0.0131921 0.0785533 -0.2486229 0.0088338 0.0352045 0.1224383 -0.2728135 -0.1028111 0.0237776 0.0738858 0.0887386 -0.076009 -0.0193143 -0.0244279 -0.0051989 -0.0370622 0.014102 -0.0247755 -0.0325036 0.1096557 0.0077623 0.0096891 0.0183648 -0.045879 0.013519 0.0244501 0.0209808 -0.0294651 0.1035868 0.0859891 0.0492684 -0.017604 -0.0151149 0.0521535 -0.0499666 0.0550529 0.0089586 0.1423327 0.0189725 -0.0386899 0.0477022 0.0470624 0.0204301 -0.0312201 -0.0468352 -0.0170922 0.1469558 0.7504925 -0.402099 0.2974421 -0.5281011 0.5719448 -0.2745596 0.148392 -0.1734103 0.4969833 0.7548278 -0.4340187 -0.233511 -0.5205322 0.6274663 0.2504742 -0.0656655 0.1531342 0.4294181 -0.1901354 0.1911482 -0.0184185 0.1663479 -0.0223563 -0.015759 -0.0721567 0.0889854 0.0160157 -0.1896754 0.1931782 -0.0138306 0.1813877 -0.0303978 0.0244414 0.0481214 -0.0848528 0.0309842 0.0369754 -0.0024082 0.0730131 -0.0033504 0.0723874 0.0144182 0.0530953 -0.0057475 -0.0818753 0.0344613 -0.0102741 -0.0749765 -0.0122939 0.0676875 -0.0335403 -0.0518731 -0.0212898 -0.0752186 -0.0300607 0.0896941 0.0544465 0.0827097 -0.0044303 -0.0417776 0.0674821 -0.0726958 0.0218177 0.035757 -0.0103808 -0.0301515 -0.0259678 0.0412003 0.0202876 -0.0333087 0.0750363 -0.1139993 0.0626585 -0.0511116 -0.0228519 -0.0134901 -0.0926174 -0.0733285 0.0052986 -0.1021689 0.0120724 0.0174133 -0.0012712 0.0088317 0.0092627 0.0435737 0.044562 -0.027238 0.0959066 -0.1191022 0.0403042 0.0164662 -0.0019964 0.0319624 0.0651918 0.0125447 -0.0532029 -0.0418553 -0.1705782 -0.0306778 -0.1118421 0.0260811 -0.1209587 -0.1027377 0.0453722 0.0518812 0.0760623 0.0596562 0.0704562 -0.0107549 -0.0057334 -0.0259599 0.0333923 0.0121171 0.0695167 -0.0012179 -0.1725799 -0.1771696 0.067704 -0.0464287 0.0684634 0.0435606 0.0205106 -0.0770439 0.0286552 0.0594095 0.1391174 -0.0839915 -0.0449601 -0.0899654 -0.0023231 -0.0314416 -0.0349265 -0.0491314 0.0608061 0.1411679 -0.0791307 0.0577047 -0.0818943 0.0128809 0.040478 0.0485751 0.0586831 0.044846 unknown
polarizability: 118.3247761|-5.3583965|109.7212922|0.3462881|0.1653684|105.5452594 unknown
InChI: InChI=1S/C11H12O2/c12-9-7-3-4-8(10(9)13)11(7)5-1-2-6-11/h3-4,7-8H,1-2,5-6H2
charge 0 multiplicity 1
25 atoms
O  -2.264148 0.942277 -1.6171
O  -2.268512 1.171388 1.452365
C  0.724126 -0.124522 0.000735
C  -0.302122 -0.572456 -1.114158
C  -0.291355 -0.382089 1.18443
C  1.212178 1.359726 -0.137684
C  2.03277 -0.985126 0.078974
C  2.714503 1.340656 0.246186
C  3.190726 -0.025312 -0.301433
C  -1.489046 0.376207 -0.820628
C  -1.487016 0.49887 0.750211
C  -0.844738 -1.890361 -0.531496
C  -0.834197 -1.779664 0.83283
H  0.040133 -0.577809 -2.157852
H  0.060008 -0.215052 2.211493
H  0.626483 2.067142 0.477448
H  1.109241 1.686419 -1.190779
H  1.984983 -1.879541 -0.564778
H  2.174075 -1.341992 1.117182
H  2.833796 1.370259 1.346801
H  3.267542 2.199215 -0.173426
H  3.302313 0.030831 -1.401898
H  4.160242 -0.350167 0.116057
H  -1.255272 -2.706337 -1.130306
H  -1.234014 -2.487862 1.561927
