program: Gaussian 09
title: 000143701
version: EM64L-G09RevD.01
frameworkgroup: C1[X(C8H11NO)]
method: RPBEPBE
basis: SDD
operation: Freq
keyword: #p
keyword: freq=noraman
keyword: PBEPBE/SDD
title: #p freq=noraman PBEPBE/SDD
converged: YES YES NO NO
title: Mulliken charges:
elementType: O N C C C C C C C C H H H H H H H H H H H
charge: -0.430843 -0.300100 0.347771 -0.486063 0.138763 -0.356142 -0.394714 -0.259706 -0.206000 -0.623425 0.179789 0.239828 0.232085 0.261855 0.214774 0.226081 0.225902 0.228690 0.185785 0.221806 0.353864
chargesum: 0.00000
title: Mulliken charges with hydrogens summed into heavy atoms:
elementType: O N C C C C C C C C
charge: -0.076979 -0.038245 0.347771 -0.066446 0.138763 -0.124057 -0.179940 -0.033625 0.019902 0.012856
polarizability: 1.24231572e+02 -3.30920811e+00 1.03590621e+02 -9.04614278e+00 -2.71823218e+00 5.70870024e+01
1716.lowfreq: -3.2687 0.0003 0.0008 0.0008 3.1805 10.5620 46.6817 89.4187 96.6202
frequency: 46.6772 89.3834 96.6091 195.7217 226.6432 283.3987 299.8986 323.3210 346.2642 425.1431 469.5485 525.5849 550.7004 602.3335 628.7981 724.5793 752.8219 764.0947 835.3770 848.9036 928.7625 947.9561 960.4784 970.3808 1039.0940 1075.2665 1106.3217 1124.1835 1152.9233 1158.1530 1170.6764 1214.6016 1227.4023 1247.3591 1308.9113 1353.4431 1395.3243 1433.9862 1437.1481 1443.3574 1463.7184 1480.1360 1492.7730 1498.4039 1605.1292 1615.5430 2842.4681 2859.4886 3010.0932 3033.0294 3074.5694 3109.6040 3117.2997 3140.4328 3164.4317 3458.9902 3580.5648
redmass: 3.4514 2.5815 2.5470 4.1395 1.3919 2.1552 3.0510 3.0187 1.2220 3.2005 3.3668 4.7361 4.4445 4.2098 1.4615 3.0969 1.3929 4.2092 2.0127 2.3657 1.4446 2.0840 1.5617 1.3216 2.1473 2.0051 1.3556 1.9078 2.5506 1.3031 1.0560 2.0954 1.4713 2.4797 1.3367 1.3863 7.0567 1.1627 2.3067 1.1947 1.0638 1.1370 1.2511 1.7812 6.4297 6.8004 1.0714 1.0581 1.0734 1.0862 1.0993 1.0881 1.0890 1.0918 1.1002 1.0752 1.0660
irintensity: 1.9494 2.0939 5.2178 0.9310 0.6633 3.0200 6.8707 13.2756 119.2234 8.2997 5.3905 14.8753 8.9940 19.5341 108.3686 4.6199 94.3778 8.1994 12.2373 9.1834 4.3422 3.7690 7.8866 0.2339 12.2320 91.4972 22.9094 38.9150 58.4532 18.0528 0.7455 14.5593 2.0629 42.7698 28.1757 6.7811 11.3718 0.3624 35.2678 23.4791 10.3112 11.0532 14.1265 20.7170 26.4426 6.1342 84.1233 212.3953 51.8713 12.0878 37.6609 17.8843 7.1952 22.2475 24.1129 0.4307 28.3455
temp: 298.150 k
press: 1.00000 atm
elementType: 8 7 6 6 6 6 6 6 6 6 1 1 1 1 1 1 1 1 1 1 1
symmnumber: 1
zpe: 456245.0 jmol-1
zpe.correction: 0.173775 hartree
zpe.thermalcorrener: 0.183764 hartree
zpe.thermalcorrenthalpy: 0.184709 hartree
zpe.thermalcorrgfe: 0.138154 hartree
zpe.sumelectzpe: -440.647056 hartree
zpe.sumelectthermal: -440.637066 hartree
zpe.sumelectthermalent: -440.636122 hartree
zpe.sumelectthermalfe: -440.682676 hartree
dipole: 0.9332 -0.1315 -0.0923
dipole: 0.9469
quadrupole: -53.0905 -50.6248 -63.5817
quadrupole: 5.8640 -2.3922 -0.1303
quadrupole: 2.6752 5.1409 -7.8161 5.8640 -2.3922 -0.1303
hfenergy: -440.8208304 hartree
pointgroup: C01 [X(C8H11N1O1)]
dipole: -0.3673352 0.0456318 -0.0421345 debye
dipolederiv: -0.3232499 0.502196 0.0540448 0.43229 -1.1161469 0.1078385 0.0642043 0.1286882 -0.3737095 -0.8072978 -0.0807006 -0.0238213 -0.0397096 -0.2701222 -0.2229365 0.013035 -0.1736922 -0.5304378 0.1140463 -0.0885795 0.0554419 0.162932 -0.2419287 0.0351393 -0.0015711 -0.0244187 -0.1047592 0.387371 0.056165 -0.1134532 0.1527366 0.2802453 0.080847 -0.1160759 0.1266199 0.5342457 0.2321726 -0.4570163 0.0137123 -0.40382 1.0647856 -0.0821958 -0.0240508 -0.0895871 0.0656675 0.1063442 0.0104823 0.0749598 -0.0501367 0.1068632 0.0141359 0.0837461 0.026733 -0.13275 -0.1546689 0.3099212 0.0285137 -0.0037176 -0.1119746 0.0096738 0.0199583 0.1058972 -0.1926192 -0.2059233 -0.0719204 0.0004718 -0.1284539 -0.034255 -0.0115433 -0.0121607 -0.0007884 -0.194014 0.0742367 -0.0486543 0.0667647 0.1147379 0.1286329 0.0431572 0.0697712 0.0043958 -0.1224545 0.5587706 0.0706856 0.1064401 -0.061299 0.2758558 0.1128399 0.2002001 0.0958388 0.2181243 -0.0608297 -0.0362954 -0.0260861 -0.0326101 -0.1212891 -0.2239086 0.0785139 -0.1093783 -0.1666453 0.0274475 0.0464798 -0.0296807 0.0624714 -0.0349771 0.1050874 0.0170496 0.0472656 0.0021943 0.0402215 -0.1045513 -0.0466468 -0.0904722 -0.0493513 -0.0363638 -0.0385817 -0.0491488 0.1244919 0.1101116 0.0746009 0.0263893 0.0836682 0.0566778 0.195604 0.0280791 0.0606127 0.1923331 0.0436668 -0.0546368 -0.0354002 -0.0863947 -0.1139076 -0.0390957 -0.0382337 -0.0324913 0.158725 0.0278243 0.0881079 -0.0288023 0.1021748 -0.0763645 0.003608 -0.0347459 0.0008863 0.1638105 -0.1165304 0.0082768 -0.0722561 0.0001517 0.0874656 -0.0055842 -0.0762442 -0.0042356 0.1392237 0.0333411 0.0148259 -0.0192812 0.0948728 -0.1214748 0.0918129 -0.1030389 0.0942505 0.0470722 -0.1632937 -0.0552226 -0.0447758 -0.1673087 -0.1199773 -0.1547423 -0.2040302 -0.1639319 -0.0662058 -0.0630777 -0.0118565 0.0909729 -0.0439229 0.1059748 0.0137562 0.1562623 0.0206057 -0.1091947 0.1393172 -0.1723079 -0.0775076 -0.09819 0.3052682 -0.0371301 -0.0820869 -0.0641214 0.3469018 unknown
polarizability: 124.0566199|-2.9069827|103.5602256|9.9970649|2.2145456|57.2923497 unknown
InChI: InChI=1S/C8H11NO/c1-9-6-7-4-2-3-5-8(7)10/h2-5,9-10H,6H2,1H3
charge 0 multiplicity 1
21 atoms
O  0.072733 -2.17751 0.232264
N  2.372932 0.290831 -0.510713
C  0.068989 0.230456 0.372901
C  1.547068 0.217761 0.718494
C  -0.638736 -0.970965 0.097389
C  -0.643998 1.449166 0.284012
C  -2.005154 -0.947695 -0.271551
C  -2.008587 1.492382 -0.086746
C  -2.686685 0.285866 -0.368958
C  3.825139 0.266063 -0.270086
H  1.762362 1.05845 1.427609
H  1.803926 -0.724117 1.236491
H  -0.113765 2.381793 0.515891
H  2.077261 1.064689 -1.119264
H  -2.535777 -1.886779 -0.478845
H  -2.534298 2.45071 -0.149314
H  -3.743676 0.298415 -0.656926
H  4.107233 -0.704054 0.180496
H  4.197089 1.071381 0.412824
H  4.362111 0.355578 -1.231091
H  -0.499267 -2.947522 -0.009778
