program: Gaussian 09
title: 000143699
version: EM64L-G09RevD.01
frameworkgroup: C1[X(C12H14)]
method: RPBEPBE
basis: SDD
operation: Freq
keyword: #p
keyword: freq=noraman
keyword: PBEPBE/SDD
title: #p freq=noraman PBEPBE/SDD
converged: YES YES NO NO
title: Mulliken charges:
elementType: C C C C C C C C C C C C H H H H H H H H H H H H H H
charge: 0.279947 0.279381 -0.520281 -0.520446 -0.555174 -0.554857 -0.304284 -0.304342 -0.202834 -0.202832 -0.244052 -0.244063 0.225845 0.232941 0.233019 0.225911 0.224795 0.207687 0.207702 0.224817 0.226349 0.226385 0.214327 0.214385 0.214837 0.214836
chargesum: 0.00000
title: Mulliken charges with hydrogens summed into heavy atoms:
elementType: C C C C C C C C C C C C
charge: 0.279947 0.279381 -0.061495 -0.061517 -0.122691 -0.122338 -0.077935 -0.077957 0.011493 0.011553 -0.029215 -0.029227
polarizability: 1.30492959e+02 -2.73961566e-03 1.25901040e+02 -7.76293868e+00 -1.92247863e-03 8.69673234e+01
1716.lowfreq: -20.2446 -16.0378 -9.9585 -0.0006 -0.0004 -0.0003 69.8858 127.1429 158.7635
frequency: 69.8422 127.1222 158.7586 237.0081 252.0178 288.0404 386.9421 404.3479 419.3249 433.7915 476.4453 536.5892 559.3964 616.1977 624.9166 690.3621 719.0723 744.2371 759.9210 795.7920 811.7727 869.7358 875.7237 920.9668 924.2559 954.1916 958.6937 961.8340 967.9208 976.6982 992.7271 1013.6792 1037.4697 1057.2376 1100.5160 1123.4180 1156.0030 1169.8431 1178.2371 1199.6021 1212.9602 1216.3645 1222.7956 1229.5231 1252.4745 1259.3778 1308.1213 1320.9293 1361.5882 1369.3374 1405.1142 1452.1476 1453.6130 1457.2229 1463.9991 1604.4619 1651.0285 1658.4046 2950.1096 2952.8015 3002.1638 3010.5299 3011.9939 3013.8553 3065.8928 3084.1710 3086.8937 3091.1262 3100.8394 3121.9561 3134.0076 3142.7531
redmass: 2.4530 2.7444 2.7951 2.1110 2.7647 2.4078 2.5238 3.2961 2.0878 4.7559 2.8542 3.7344 3.8153 3.2237 3.6477 1.4162 1.4731 3.6408 1.1960 1.4224 3.3280 2.0589 2.1553 2.5110 3.2096 2.1571 1.2540 1.7763 2.1039 1.2952 1.7912 2.0347 2.4230 2.7968 2.9523 1.9917 1.3724 2.3503 1.1634 1.2403 1.2255 1.2977 1.2435 1.3343 1.5552 1.4527 1.5284 1.7724 1.5056 1.6696 1.7731 1.0862 1.0805 1.0938 1.1096 9.3329 6.0869 6.5459 1.0626 1.0625 1.0574 1.0693 1.0959 1.0897 1.1070 1.0849 1.0862 1.1070 1.0847 1.0943 1.1009 1.0993
irintensity: 0.0019 0.0928 0.0754 0.0873 0.0004 0.2947 1.2837 0.6124 9.9480 1.2214 1.0947 0.3660 6.1846 0.3339 0.0603 49.1364 94.0131 0.1459 9.0798 0.0354 2.8554 17.1751 0.5825 0.9535 0.6261 0.9000 0.8343 2.1272 0.3253 0.1056 3.2298 8.7906 2.3437 1.3674 0.6445 3.3135 3.4259 0.8543 0.0130 6.6909 0.0817 11.3957 3.9900 1.5223 4.3227 2.8195 0.7499 3.1133 1.6024 3.2111 0.7626 0.3091 16.4692 7.8628 9.2627 7.2298 0.2146 6.0494 33.4641 33.9264 27.4951 21.7504 51.1918 38.7879 0.0121 17.1703 0.0458 48.0421 9.0254 43.2540 64.9217 38.0226
temp: 298.150 k
press: 1.00000 atm
elementType: 6 6 6 6 6 6 6 6 6 6 6 6 1 1 1 1 1 1 1 1 1 1 1 1 1 1
symmnumber: 1
zpe: 581500.0 jmol-1
zpe.correction: 0.221482 hartree
zpe.thermalcorrener: 0.231379 hartree
zpe.thermalcorrenthalpy: 0.232323 hartree
zpe.thermalcorrgfe: 0.186798 hartree
zpe.sumelectzpe: -464.724267 hartree
zpe.sumelectthermal: -464.714370 hartree
zpe.sumelectthermalent: -464.713426 hartree
zpe.sumelectthermalfe: -464.758951 hartree
dipole: -0.3110 0.0003 0.1018
dipole: 0.3273
quadrupole: -69.4453 -67.0282 -75.1063
quadrupole: -0.0025 -1.2352 -0.0025
quadrupole: 1.0813 3.4984 -4.5797 -0.0025 -1.2352 -0.0025
hfenergy: -464.9457487 hartree
pointgroup: C01 [X(C12H14)]
dipole: -0.1211813 0.0000091 -0.0435264 debye
dipolederiv: 0.0736951 0.0783256 -0.0675455 0.0371669 -0.0743793 -0.021133 -0.0957165 -0.008879 0.0585586 0.0735122 -0.0773637 -0.0684914 -0.0361799 -0.0748191 0.0198659 -0.0965 0.0073841 0.0591887 0.0681192 -0.0082266 -0.0346231 0.0473575 0.0218273 0.065351 0.0039673 0.1165428 -0.0075159 0.0682252 0.0091311 -0.0345773 -0.0465904 0.0235313 -0.065123 0.0034267 -0.1162384 -0.0095991 -0.1224736 0.0157235 -0.003495 0.0426166 0.1512975 0.0515546 -0.0465739 0.0801291 0.1417596 -0.122717 -0.015898 -0.0033842 -0.0424368 0.1530174 -0.0515665 -0.0467104 -0.0799765 0.1399171 0.1129065 -0.0102161 0.1676534 -0.066657 0.001742 -0.0386275 0.1714512 -0.0049141 -0.1919658 0.1132392 0.0086134 0.1674599 0.0652449 0.0015417 0.0405153 0.1719111 0.0070882 -0.1917319 0.1504501 -0.072341 0.0436967 -0.107496 -0.0070971 0.0008882 0.0876085 -0.0678288 -0.2436156 0.1501852 0.0720553 0.0446077 0.106705 -0.0079198 0.0019316 0.0889792 0.0704391 -0.2426856 -0.0364583 -0.1950785 0.0198333 -0.1094102 0.1055165 -0.047119 0.0410402 -0.0423871 -0.1668293 -0.0369732 0.194775 0.0215844 0.108774 0.1051354 0.0496541 0.0418803 0.0448454 -0.1659471 -0.099671 -0.1217343 -0.1106967 -0.0736029 0.0156718 -0.0317931 -0.0614022 -0.0235828 0.0419396 -0.0404877 0.1000029 0.1283315 0.0396301 0.0109539 -0.0636877 0.0855928 -0.0340416 0.0033253 -0.0396533 -0.1017215 0.1271576 -0.0407736 0.0091912 0.064503 0.0850594 0.0345789 0.0042267 -0.1006114 0.1223801 -0.109265 0.0737593 0.0159633 0.0307422 -0.060629 0.0228819 0.0428419 0.0437135 0.072808 -0.0462496 0.0196877 0.0541833 0.0019945 -0.0375362 0.0430651 -0.1348501 0.0331544 -0.0072824 0.0110034 -0.0282996 -0.1652163 -0.0365684 0.0039393 -0.0990205 0.0561724 0.0332281 0.0073539 0.0110595 0.0284838 -0.1668397 0.0338484 0.0041459 0.0962429 0.0578131 0.0438142 -0.0721649 -0.0473102 -0.0192716 0.0545477 0.0003637 -0.0378468 -0.0407751 -0.1352397 0.0588784 -0.0207561 -0.024827 0.0396308 -0.144913 0.0226403 -0.0267681 0.0054265 0.1288649 0.0588334 0.0212833 -0.0245293 -0.0391122 -0.1446978 -0.0251824 -0.0271352 -0.0079024 0.1285469 -0.1445067 -0.0780621 -0.0065619 -0.0902329 0.0152479 -0.0045899 -0.0433998 -0.0158408 0.1647621 -0.1446917 0.0778706 -0.0056867 0.0904457 0.0152983 0.0028385 -0.0424384 0.014078 0.1650171 -0.0969917 0.1015545 -0.0771558 0.0883617 0.015506 0.0253659 -0.0828045 0.0295084 0.1487673 -0.096719 -0.1010318 -0.0779887 -0.0878008 0.0157096 -0.0266667 -0.0835406 -0.0308233 0.1482789 unknown
polarizability: 130.0147328|-0.0409564|125.8999085|8.9915289|0.2095151|87.4466819 unknown
InChI: InChI=1S/C12H14/c1-2-6-12-8-4-3-7-11(12,5-1)9-10-12/h1-6H,7-10H2
charge 0 multiplicity 1
26 atoms
C  0.031476 -0.805143 -0.176368
C  0.029742 0.79986 -0.167893
C  -0.191157 -0.778114 -1.742451
C  -0.194537 0.789264 -1.73376
C  -1.156406 -1.460035 0.59099
C  -1.158252 1.444089 0.60816
C  1.336335 -1.454618 0.232233
C  1.333955 1.447426 0.245891
C  -2.453589 -0.687897 0.437434
C  -2.454537 0.672272 0.445614
C  2.457251 -0.741409 0.54751
C  2.456093 0.733147 0.55418
H  -1.145287 -1.233196 -2.062988
H  0.635951 -1.227648 -2.318073
H  0.62972 1.248916 -2.305441
H  -1.151166 1.243467 -2.048034
H  -0.890178 -1.520181 1.668136
H  -1.275553 -2.504763 0.241728
H  -1.278803 2.492909 0.271937
H  -0.891206 1.491093 1.685756
H  1.350398 -2.553943 0.261631
H  1.346337 2.546477 0.285289
H  -3.39355 -1.246766 0.340737
H  -3.395264 1.230907 0.355337
H  3.38242 -1.262348 0.823757
H  3.380509 1.253034 0.834889
