program: Gaussian 09
title: 000143686
version: EM64L-G09RevD.01
frameworkgroup: C1[X(C13H24)]
method: RPBEPBE
basis: SDD
operation: Freq
keyword: #p
keyword: freq=noraman
keyword: PBEPBE/SDD
title: #p freq=noraman PBEPBE/SDD
converged: YES YES NO NO
title: Mulliken charges:
elementType: C C C C C C C C C C C C C H H H H H H H H H H H H H H H H H H H H H H H H
charge: -0.381845 -0.371693 -0.368798 -0.352487 -0.372972 -0.356628 -0.470339 -0.696299 -0.047476 -0.440769 -0.348868 -0.044911 -0.688693 0.193893 0.193797 0.189163 0.189475 0.191495 0.192015 0.187824 0.188009 0.211742 0.210613 0.194904 0.194631 0.228655 0.228342 0.215061 0.209799 0.209736 0.223273 0.223331 0.212236 0.211362 0.209770 0.209466 0.223191
chargesum: 0.00000
title: Mulliken charges with hydrogens summed into heavy atoms:
elementType: C C C C C C C C C C C C C
charge: 0.005844 0.006945 0.014711 0.023345 0.049382 0.032907 -0.013342 -0.061703 -0.047476 0.005835 0.074730 -0.044911 -0.046267
polarizability: 2.05224561e+02 -1.02596890e+01 1.18451420e+02 -1.71278155e+00 2.01433862e+00 1.09190603e+02
1716.lowfreq: -6.9768 -0.0008 0.0007 0.0012 6.1687 14.6039 19.1410 30.9216 40.3121
frequency: 15.4453 30.6176 36.5627 49.4062 69.2165 82.1155 91.0301 102.7968 113.8841 140.5541 149.8335 171.7691 215.2569 228.4047 231.8770 250.0030 304.8783 309.7031 348.8597 424.8702 437.9449 475.5135 515.8878 719.7071 724.9997 736.4732 741.7974 779.3584 783.2290 850.2728 860.0746 885.3717 890.0922 928.5241 982.0153 1003.5193 1010.4221 1040.2607 1047.7754 1056.9565 1077.8748 1080.3725 1092.6279 1095.6306 1108.3366 1119.5546 1163.8336 1186.1584 1213.8969 1221.6712 1226.7168 1254.8170 1257.8660 1276.8995 1278.5133 1282.1469 1283.5204 1291.3846 1292.6254 1295.1349 1324.0631 1340.0048 1345.3567 1355.3981 1355.6804 1390.4150 1390.7060 1456.4180 1459.2366 1461.2433 1462.3282 1465.8574 1471.2806 1473.3183 1477.0885 1478.3013 1478.6685 1484.6166 1484.8158 1488.8037 2276.3217 2949.3759 2950.9840 2953.4009 2958.5727 2959.3414 2960.9340 2968.2597 2971.6301 2973.2813 2984.2655 2985.1781 2990.9145 2995.3017 3000.1721 3002.4165 3004.3231 3021.1279 3036.8551 3044.6937 3053.5614 3068.0070 3070.5971 3074.8257 3075.7125
redmass: 2.6695 2.7370 2.2459 2.5869 2.6027 1.8891 2.8320 2.7246 2.4867 2.0229 2.0285 3.5267 2.4575 1.2268 1.1268 3.2093 3.1790 3.1231 3.6746 4.0053 3.2593 4.8920 3.9277 1.0604 1.0784 1.1037 1.1240 3.3333 1.2175 1.2397 1.2277 2.0063 1.8995 1.2295 4.8277 1.1456 4.2110 3.1433 3.0305 2.9437 2.3647 2.1865 1.7014 1.6314 1.3748 2.6084 2.7570 1.7513 1.2739 1.4175 1.3076 1.3093 1.2609 1.3376 1.0679 1.1197 1.0820 1.1013 1.3427 1.1086 1.4092 1.5023 1.5257 1.6297 1.6552 1.2177 1.2153 1.0813 1.0807 1.0742 1.0703 1.0712 1.0790 1.0556 1.0434 1.0790 1.0421 1.0884 1.0777 1.0924 11.7059 1.0589 1.0590 1.0593 1.0582 1.0582 1.0590 1.0586 1.0367 1.0359 1.0960 1.0598 1.0988 1.0603 1.0995 1.0997 1.1024 1.1043 1.1047 1.1017 1.1047 1.1006 1.0994 1.1024 1.0989
irintensity: 0.0232 0.1048 0.0072 0.2301 0.3436 0.5349 0.2264 0.0810 0.2537 0.0920 0.0234 0.7818 5.8694 0.4320 0.0082 4.9586 3.2783 1.0647 0.4693 0.0794 2.2358 1.0078 4.0354 15.9249 0.1342 7.7580 3.8636 0.4315 0.3708 1.0785 0.9235 7.8918 3.9373 0.4119 0.6411 0.2870 1.6539 2.7870 0.4835 0.0379 0.7345 0.1281 6.1648 2.6093 0.9332 13.6626 1.2094 0.2294 8.4475 0.0253 0.0899 0.3176 0.1428 2.2814 0.4038 1.0816 0.0445 0.1463 2.4503 0.0109 2.4004 1.4867 2.9354 1.1990 0.0497 11.2513 12.7529 2.7256 1.5530 0.0599 0.1851 0.1806 1.4396 3.0856 12.0451 2.1469 13.1039 2.8107 15.2885 28.9770 0.1928 2.6307 1.1869 0.1691 17.3102 30.1572 42.2436 135.0694 36.6519 42.7687 1.4605 58.8140 1.5172 32.6888 7.8620 9.1864 0.0965 0.0020 74.4972 1.8685 119.7229 97.2470 58.0624 87.4178 48.1256
temp: 298.150 k
press: 1.00000 atm
elementType: 6 6 6 6 6 6 6 6 6 6 6 6 6 1 1 1 1 1 1 1 1 1 1 1 1 1 1 1 1 1 1 1 1 1 1 1 1
symmnumber: 1
zpe: 878720.0 jmol-1
zpe.correction: 0.334687 hartree
zpe.thermalcorrener: 0.352466 hartree
zpe.thermalcorrenthalpy: 0.353411 hartree
zpe.thermalcorrgfe: 0.285862 hartree
zpe.sumelectzpe: -508.660200 hartree
zpe.sumelectthermal: -508.642421 hartree
zpe.sumelectthermalent: -508.641477 hartree
zpe.sumelectthermalfe: -508.709025 hartree
dipole: -0.1022 -0.0211 0.1015
dipole: 0.1456
quadrupole: -79.1454 -83.4995 -82.8775
quadrupole: -2.7939 -0.1269 -0.0526
quadrupole: 2.6954 -1.6587 -1.0367 -2.7939 -0.1269 -0.0526
hfenergy: -508.9948872 hartree
pointgroup: C01 [X(C13H24)]
dipole: 0.0403085 -0.0094001 -0.0395787 debye
polarizability: 205.2106511|10.3120863|118.3513024|-1.7569003|-2.2534365|109.3046305 unknown
InChI: InChI=1S/C13H24/c1-3-5-7-9-11-13-12-10-8-6-4-2/h3-7,9,11-13H2,1-2H3
charge 0 multiplicity 1
37 atoms
C  2.426609 -0.213279 0.073964
C  3.813071 0.446856 -0.100623
C  1.253762 0.784944 -0.052812
C  4.986101 -0.552395 0.017876
C  -0.128618 0.121708 0.130673
C  6.373297 0.108021 -0.153087
C  -1.294089 1.140946 -0.012703
C  7.538762 -0.898683 -0.040072
C  -2.629069 0.541217 0.170407
C  -5.074741 -0.580545 0.504217
C  -6.116791 -0.118774 -0.554438
C  -3.741777 0.026491 0.326105
C  -7.495761 -0.772341 -0.326274
H  2.379398 -0.709533 1.065841
H  2.306087 -1.017799 -0.681269
H  3.85852 0.948049 -1.090407
H  3.935988 1.247666 0.658537
H  1.297918 1.27653 -1.047595
H  1.377527 1.592737 0.698967
H  4.866075 -1.351746 -0.74327
H  4.940984 -1.056343 1.006244
H  -0.188897 -0.355812 1.128109
H  -0.262014 -0.686135 -0.615056
H  6.494127 0.903711 0.610288
H  6.416019 0.614865 -1.138946
H  -1.236928 1.615337 -1.013975
H  -1.150304 1.957902 0.724084
H  8.518548 -0.401726 -0.164944
H  7.53653 -1.398487 0.947165
H  7.457701 -1.685837 -0.813478
H  -4.986773 -1.685727 0.462515
H  -5.460909 -0.339924 1.516019
H  -6.205127 0.983434 -0.513213
H  -5.737963 -0.368589 -1.563586
H  -7.899912 -0.51232 0.670443
H  -7.428825 -1.875367 -0.38466
H  -8.227525 -0.438655 -1.084143
