program: Gaussian 09
title: 000143665
version: EM64L-G09RevD.01
frameworkgroup: C1[X(C13H20O)]
method: RPBEPBE
basis: SDD
operation: Freq
keyword: #pfreq=noraman
keyword: PBEPBE/SDD
title: #p freq=noraman PBEPBE/SDD
converged: YES YES NO NO
title: Mulliken charges:
elementType: O C C C C C C C C C C C C C H H H H H H H H H H H H H H H H H H H H
charge: -0.229991 0.366665 -0.467312 -0.470098 -0.530250 -0.388901 -0.436843 -0.140015 -0.426753 -0.393553 -0.366068 -0.544779 -0.362144 0.166392 0.204354 0.227309 0.200495 0.209212 0.217153 0.220635 0.199514 0.192677 0.199077 0.214615 0.220286 0.199063 0.201990 0.205883 0.195279 0.193031 0.195588 0.238382 0.243689 0.245418
chargesum: 0.00000
title: Mulliken charges with hydrogens summed into heavy atoms:
elementType: O C C C C C C C C C C C C C
charge: -0.229991 0.366665 -0.035648 -0.060391 -0.092462 0.003290 -0.023151 0.080271 -0.025700 0.007610 0.022551 -0.062709 -0.116726 0.166392
polarizability: 1.79527880e+02 1.16645786e+00 1.18067216e+02 3.60063288e+00 -4.22198632e+00 1.13522596e+02
1716.lowfreq: -30.0450 -15.0254 -0.0009 -0.0009 -0.0009 11.9461 46.8627 62.7005 144.6117
frequency: 46.7552 62.2586 144.5706 164.5471 178.2746 192.2308 226.2047 250.2331 259.0352 318.5288 350.8320 363.4548 372.8670 402.2320 429.3966 469.2183 474.0633 506.2011 543.9642 608.8443 653.6318 710.9289 735.3500 751.7940 758.1514 776.2600 829.4232 832.1589 873.9630 877.6141 879.7117 931.5985 951.6419 980.0509 996.1386 1003.5464 1005.1182 1032.7633 1057.1939 1068.9048 1097.2342 1116.1762 1124.0878 1127.5988 1135.9649 1167.4002 1187.3674 1209.9898 1218.8166 1243.5306 1245.2879 1263.2999 1265.4468 1279.0385 1295.8315 1316.9947 1330.6048 1333.4262 1339.4403 1340.8415 1346.4127 1355.7158 1365.3830 1368.3275 1377.0449 1443.6259 1458.3265 1460.5743 1461.6032 1463.7734 1469.9727 1474.4443 1489.4660 1498.2544 1584.7180 1622.2569 2953.2905 2958.0620 2967.5786 2968.5846 2973.3239 2976.1132 2980.3848 2980.7827 2984.7779 3003.9878 3009.3919 3016.8023 3021.9397 3028.4204 3033.7400 3036.5879 3042.9449 3062.3134 3079.8369 3140.9115
redmass: 5.1552 3.4895 3.0114 3.1026 3.3431 2.5208 2.0677 2.7329 2.3287 2.0657 2.8966 2.0162 2.7644 2.0798 3.5246 1.8852 2.3288 2.6881 2.6198 3.2888 2.5818 3.0136 2.2841 2.1359 1.6386 1.8557 1.5770 2.1972 2.0708 1.9774 1.8512 2.4135 1.9271 1.8983 1.8558 1.7399 1.6657 2.1908 1.8678 2.2373 2.2599 1.7693 1.7813 2.2350 1.3455 1.2861 1.5342 1.3027 1.3445 1.3838 1.6656 1.1997 1.3542 1.3628 1.2282 1.3490 1.3833 1.3881 1.5389 1.4665 1.4019 1.4119 1.3769 1.3841 1.7118 1.0794 1.0778 1.0837 1.0833 1.0867 1.0873 1.0840 1.0782 1.0807 9.7194 7.3350 1.0606 1.0609 1.0618 1.0631 1.0621 1.0634 1.0635 1.0636 1.0637 1.0996 1.0953 1.1001 1.0988 1.1009 1.0999 1.1000 1.0987 1.0956 1.0871 1.0957
irintensity: 3.8310 1.2507 0.1620 1.3659 0.6651 0.6179 0.2448 0.1701 1.0397 0.1387 1.5701 0.0828 2.3701 6.6951 6.7742 0.2209 1.3896 1.4445 0.8770 0.4656 3.2689 0.6583 0.1246 2.2799 11.3634 9.9346 34.1688 17.2831 5.4564 4.0337 2.5997 3.1671 3.3819 9.0878 1.7454 5.1151 1.8058 0.1287 1.8865 3.4247 0.6267 11.7139 5.9133 0.8321 0.2273 8.5119 7.8240 13.2035 1.3452 3.8852 21.8665 2.1064 6.8785 2.2660 1.3044 3.3157 0.3884 4.2135 2.1497 0.8271 0.1664 0.1004 0.0338 1.9640 10.0355 17.8079 2.0362 11.2116 7.2716 15.8991 3.3465 8.3198 6.4679 29.4417 131.5536 129.6416 31.5408 11.2938 39.2252 18.5175 22.8477 23.4921 13.5040 36.8920 17.9053 7.4606 104.1045 21.1358 37.3936 85.4532 106.0983 18.5578 71.1436 22.5338 18.1680 14.4215
temp: 298.150 k
press: 1.00000 atm
elementType: 8 6 6 6 6 6 6 6 6 6 6 6 6 6 1 1 1 1 1 1 1 1 1 1 1 1 1 1 1 1 1 1 1 1
symmnumber: 1
zpe: 790538.4 jmol-1
zpe.correction: 0.301100 hartree
zpe.thermalcorrener: 0.314265 hartree
zpe.thermalcorrenthalpy: 0.315209 hartree
zpe.thermalcorrgfe: 0.262130 hartree
zpe.sumelectzpe: -581.485583 hartree
zpe.sumelectthermal: -581.472418 hartree
zpe.sumelectthermalent: -581.471474 hartree
zpe.sumelectthermalfe: -581.524553 hartree
dipole: 4.9636 0.1980 0.2588
dipole: 4.9742
quadrupole: -111.8592 -84.2359 -83.2311
quadrupole: -1.1959 -1.1037 -1.4821
quadrupole: -18.7504 8.8728 9.8776 -1.1959 -1.1037 -1.4821
hfenergy: -581.7866828 hartree
pointgroup: C01 [X(C13H20O1)]
dipole: -1.9527652 -0.0706301 0.107865 debye
polarizability: 179.509754|0.9612295|117.9022441|-3.8112192|4.3146941|113.7056936 unknown
InChI: InChI=1S/C13H20O/c14-12-6-10-13(11-7-12)8-4-2-1-3-5-9-13/h6,10H,1-5,7-9,11H2
charge 0 multiplicity 1
34 atoms
O  4.432211 0.135353 -0.2641
C  0.168207 -0.155678 0.221094
C  -0.494011 0.918301 -0.726146
C  -0.86781 -0.911171 1.114183
C  0.990748 -1.176435 -0.622147
C  -1.584684 1.834694 -0.095621
C  -1.902867 -1.831708 0.424863
C  1.11213 0.579305 1.171242
C  -3.049672 1.468464 -0.453478
C  -2.966338 -1.161342 -0.490138
C  -3.621467 0.128818 0.082052
C  2.287918 -0.579864 -1.213825
C  2.468035 0.659168 1.018835
C  3.17112 0.067456 -0.144986
H  -0.921448 0.393883 -1.601492
H  0.320411 1.553757 -1.123772
H  -1.405413 -0.173026 1.742066
H  -0.288459 -1.53697 1.82512
H  0.362909 -1.580451 -1.438636
H  1.260518 -2.03202 0.029502
H  -1.416306 2.872379 -0.445304
H  -1.470775 1.873773 1.006249
H  -2.442669 -2.358984 1.238217
H  -1.379705 -2.622097 -0.14958
H  0.643356 1.078809 2.033574
H  -3.147324 1.469518 -1.559709
H  -3.702665 2.288001 -0.088362
H  -3.755379 -1.917672 -0.67322
H  -2.537059 -0.939451 -1.486129
H  -3.571548 0.115761 1.190126
H  -4.701282 0.118548 -0.167034
H  2.0466 0.202937 -1.961998
H  2.884149 -1.344919 -1.741835
H  3.097067 1.188662 1.744688
