program: Gaussian 09
title: 000143657
version: EM64L-G09RevD.01
frameworkgroup: C1[X(C15H16OS)]
method: RPBEPBE
basis: SDD
operation: Freq
keyword: #p
keyword: freq=noraman
keyword: PBEPBE/SDD
title: #p freq=noraman PBEPBE/SDD
converged: YES YES NO NO
title: Mulliken charges:
elementType: S O C C C C C C C C C C C C C C C H H H H H H H H H H H H H H H H
charge: 0.183440 -0.282982 -0.391814 -0.667262 -0.296914 -0.145775 0.371917 -0.172591 -0.253465 -0.350175 -0.380091 -0.247912 -0.212958 -0.222949 -0.197178 -0.241708 -0.256636 0.237831 0.214462 0.290777 0.251339 0.202495 0.223219 0.246132 0.240134 0.247368 0.249621 0.225390 0.227323 0.223573 0.227927 0.228997 0.228465
chargesum: 0.00000
title: Mulliken charges with hydrogens summed into heavy atoms:
elementType: S O C C C C C C C C C C C C C C C
charge: 0.183440 -0.282982 0.060480 -0.125146 0.128800 -0.145775 0.371917 0.073541 -0.013331 -0.102807 -0.130470 -0.022521 0.014365 0.000623 0.030749 -0.012711 -0.028171
polarizability: 2.53677938e+02 7.13013604e-02 1.76364615e+02 1.70258361e+01 -2.34773147e+00 1.12244337e+02
1716.lowfreq: -0.0027 -0.0020 -0.0017 2.0443 3.7581 12.2085 17.2322 23.2833 31.9893
frequency: 16.6023 23.1319 31.5940 44.8169 70.5061 112.3641 131.7889 149.7094 180.5073 227.8534 236.5120 256.1768 311.5795 401.3473 401.9342 412.0248 423.0413 442.3294 469.6819 503.8407 589.4941 610.1953 611.7753 676.1660 692.4564 692.5990 718.3135 741.5904 751.1796 759.0963 815.0474 823.3659 836.6552 889.2687 896.0164 912.2494 914.9180 961.7095 965.9152 982.7447 983.2254 983.6488 986.3545 1010.2650 1019.7261 1023.7947 1061.5681 1074.9793 1082.4685 1085.3735 1095.6911 1164.9809 1167.5467 1172.2198 1182.4800 1192.2881 1217.1231 1217.9185 1264.6859 1290.8674 1312.9694 1316.7742 1359.3313 1367.6247 1376.3214 1390.6558 1428.4579 1444.1111 1455.6060 1462.6856 1467.9260 1472.7461 1487.1867 1583.5809 1592.6910 1595.1835 1612.5337 2951.2385 2999.2430 3012.3304 3017.6971 3062.4310 3104.1380 3124.7336 3128.6439 3131.6736 3137.4181 3145.1019 3155.7188 3158.6268 3164.0079 3169.3328 3173.1319
redmass: 4.7364 4.3935 4.3689 5.6817 5.6867 2.5783 3.7748 4.6787 4.8405 3.9439 3.3080 2.9464 4.1483 5.0502 2.9043 2.9808 4.1029 7.1443 3.1694 2.8662 5.3468 6.4340 6.4195 6.8875 2.0793 2.1185 3.7831 1.5774 2.2907 1.6487 1.6989 1.2553 1.2812 1.4619 1.3808 3.1362 1.7426 1.3614 1.3793 4.6404 1.3748 6.0972 1.3123 2.2217 3.1945 2.0462 1.7756 2.5883 1.6139 1.5548 2.3829 1.3140 1.0801 1.0503 1.1638 1.1255 1.8528 1.6907 1.2001 1.1536 1.3304 1.3331 1.4815 1.4863 6.2711 4.6523 2.2224 2.3514 1.1280 1.2590 1.5384 1.4928 1.4464 6.0607 6.3352 5.9558 6.2352 1.0558 1.0680 1.0697 1.0878 1.1005 1.1067 1.0847 1.0848 1.0880 1.0889 1.0935 1.0925 1.0951 1.0953 1.1001 1.1006
irintensity: 0.3903 0.0308 0.5427 0.7162 1.3586 1.2940 3.7243 0.3953 0.3679 0.9427 3.1407 0.3255 3.6530 1.5602 0.0560 0.0387 1.1243 3.0975 11.9759 12.2219 7.0975 0.3800 0.1820 21.9317 49.5385 18.3239 4.1168 81.5145 11.4711 91.4878 6.6878 0.1732 1.2455 9.0812 2.0157 37.3439 4.4633 0.0793 0.2232 0.3992 0.4257 1.8484 0.2036 24.9373 27.5901 26.7398 7.2669 29.3228 11.2937 11.8187 7.6583 6.0679 9.5979 0.4094 42.8015 0.5756 155.0606 106.7502 4.5067 2.1984 2.2727 2.0859 5.6344 15.3956 2.2404 17.4143 7.0866 2.6618 37.1281 37.8659 14.7740 111.5371 16.3595 3.6293 35.6373 53.0428 80.6698 38.5705 7.6606 9.5907 63.7437 15.4753 18.8338 3.0040 3.3949 2.2983 11.5277 21.5568 34.0334 35.0196 22.3922 13.5230 5.4349
temp: 298.150 k
press: 1.00000 atm
elementType: 16 8 6 6 6 6 6 6 6 6 6 6 6 6 6 6 6 1 1 1 1 1 1 1 1 1 1 1 1 1 1 1 1
symmnumber: 1
zpe: 701772.2 jmol-1
zpe.correction: 0.267291 hartree
zpe.thermalcorrener: 0.283285 hartree
zpe.thermalcorrenthalpy: 0.284229 hartree
zpe.thermalcorrgfe: 0.220081 hartree
zpe.sumelectzpe: -1053.232127 hartree
zpe.sumelectthermal: -1053.216133 hartree
zpe.sumelectthermalent: -1053.215189 hartree
zpe.sumelectthermalfe: -1053.279337 hartree
dipole: 1.3011 -0.1497 1.4872
dipole: 1.9817
quadrupole: -100.3263 -101.2464 -110.0718
quadrupole: -3.9544 4.5274 -2.9661
quadrupole: 3.5552 2.6351 -6.1903 -3.9544 4.5274 -2.9661
hfenergy: -1053.499418 hartree
pointgroup: C01 [X(C15H16O1S1)]
dipole: 0.4831964 0.3160824 -0.5238859 debye
polarizability: 251.5734719|9.0685319|165.376408|-22.3645658|23.8096473|125.3370104 unknown
InChI: InChI=1S/C15H16OS/c1-3-8-14(9-4-1)16-12-7-13-17-15-10-5-2-6-11-15/h1-6,8-11H,7,12-13H2
charge 0 multiplicity 1
33 atoms
S  -2.47682 1.389152 1.267741
O  2.021587 0.420386 0.578666
C  0.235516 1.984019 1.030894
C  -0.830106 1.075646 0.394277
C  1.604227 1.816894 0.362561
C  -3.614295 0.230984 0.410597
C  3.263522 0.014986 0.058302
C  -3.215887 -0.647805 -0.625313
C  -4.967348 0.243763 0.839665
C  4.140495 0.858587 -0.668379
C  3.612032 -1.336272 0.307491
C  -4.167718 -1.505069 -1.225253
C  -5.908705 -0.615662 0.235167
C  5.367107 0.335379 -1.1421
C  4.836655 -1.840885 -0.171167
C  -5.515187 -1.495581 -0.801811
C  5.723273 -1.008864 -0.899637
H  0.330965 1.754847 2.108263
H  -0.06582 3.046027 0.941972
H  -0.554251 0.016487 0.518493
H  -0.956139 1.304932 -0.678992
H  1.547192 2.02584 -0.726659
H  2.345161 2.503985 0.819983
H  -2.178625 -0.679486 -0.971363
H  -5.280899 0.922076 1.641501
H  3.887417 1.903934 -0.868727
H  2.916012 -1.963156 0.87363
H  -3.847848 -2.181729 -2.025904
H  -6.950022 -0.596221 0.575861
H  6.044478 0.988816 -1.703663
H  5.10113 -2.885941 0.025135
H  -6.247592 -2.161858 -1.269938
H  6.674795 -1.404512 -1.269694
