program: Gaussian 09
title: 000143635
version: EM64L-G09RevD.01
frameworkgroup: C1[X(C12H23Cl2NO2)]
method: RPBEPBE
basis: SDD
operation: Freq
keyword: #p
keyword: freq=noraman
keyword: PBEPBE/SDD
title: #p freq=noraman PBEPBE/SDD
converged: YES YES NO NO
title: Mulliken charges:
elementType: Cl Cl O O N C C C C C C C C C C C C H H H H H H H H H H H H H H H H H H H H H H H
charge: 0.013607 0.020741 -0.238575 -0.202615 -0.292643 -0.378790 -0.378329 -0.371701 -0.391180 -0.352689 -0.282272 -0.356535 0.095522 0.244380 -0.695406 -0.674677 -0.681850 0.194802 0.197857 0.194806 0.196510 0.190813 0.190224 0.213067 0.222631 0.189428 0.188489 0.236091 0.226972 0.195235 0.195128 0.209871 0.215993 0.210283 0.234114 0.235407 0.249651 0.244703 0.225543 0.265395
chargesum: 0.00000
title: Mulliken charges with hydrogens summed into heavy atoms:
elementType: Cl Cl O O N C C C C C C C C C C C C
charge: 0.013607 0.020741 -0.238575 -0.202615 -0.292643 0.013869 0.012987 0.009336 0.044518 0.025227 0.180791 0.033829 0.095522 0.244380 -0.059259 0.044495 0.053791
polarizability: 2.15339742e+02 -1.10258240e+01 1.57899517e+02 -1.09487417e+01 2.68071747e+00 1.52551410e+02
1716.lowfreq: -9.9065 -4.2570 -0.0024 -0.0020 0.0010 1.4008 11.7036 26.6269 31.8216
frequency: 8.1795 26.6064 31.6752 38.8152 59.6821 63.6486 69.3735 86.0934 97.8551 116.9444 133.6348 140.0475 147.9794 168.9991 185.4844 189.9638 207.3677 227.5693 228.0790 240.8526 252.1596 269.0642 295.4928 322.4649 327.3005 363.4454 409.0776 426.2594 467.1084 498.6298 557.3071 606.4422 630.1034 706.2364 720.7000 729.2654 739.1840 751.6695 791.6695 812.8766 855.5007 876.1072 890.3353 930.3884 934.9823 948.3807 994.6336 1003.1249 1009.0554 1021.6053 1046.6524 1076.5612 1079.6309 1087.2262 1115.6487 1126.2562 1139.0227 1149.9559 1183.4409 1188.1643 1220.4588 1224.2253 1231.0308 1257.7240 1264.6447 1278.2066 1282.7787 1291.2649 1293.7310 1303.3197 1336.3509 1353.9751 1357.3335 1371.1284 1376.9212 1388.7077 1396.4962 1450.6082 1458.8556 1461.8770 1462.3971 1466.1244 1467.6900 1468.3266 1473.6500 1476.6338 1479.2763 1480.3494 1486.7043 1489.9048 1631.1163 2950.8180 2953.2023 2956.2339 2963.5531 2969.0792 2971.6661 2985.9933 2993.5060 2994.6679 3001.0673 3003.3500 3006.0071 3011.6346 3023.1210 3037.9717 3050.6412 3068.3316 3070.7649 3079.9382 3100.9211 3113.6067 3120.6467 3125.2817
redmass: 3.9865 5.0685 3.2197 2.1926 4.9806 6.5731 3.3532 1.9941 2.6232 3.1084 2.2008 2.1707 3.8234 1.5012 3.7453 2.3566 4.8489 1.3531 1.6730 1.7765 2.8283 5.1557 3.7007 3.3362 4.2311 3.8763 3.8909 3.2795 3.4861 3.9773 8.4410 7.5686 4.9888 8.0808 1.0626 1.0817 4.5451 1.1144 1.1727 5.2889 1.2115 4.7175 2.0111 2.3525 1.2156 1.6157 4.3693 1.2915 1.1418 3.4760 3.2125 2.4768 2.2942 2.3392 3.5800 3.0297 2.0300 1.4715 3.5968 1.6480 1.3074 1.3628 3.6985 1.2657 1.2932 1.1010 1.0659 1.1193 1.0936 1.3163 1.4015 1.5933 1.6164 1.4805 1.2137 1.2169 1.1953 1.0475 1.0496 1.0732 1.0757 1.0494 1.0689 1.0813 1.0766 1.0426 1.0584 1.0755 1.0881 1.0968 11.2358 1.0591 1.0590 1.0593 1.0592 1.0587 1.0365 1.0970 1.0722 1.0868 1.0352 1.0580 1.1009 1.0351 1.1042 1.1044 1.1042 1.1007 1.0993 1.1081 1.0985 1.0996 1.1012 1.1017
irintensity: 0.2821 0.0176 0.5162 0.1693 0.3654 0.8183 0.2742 0.3319 0.0614 0.9359 0.3259 0.1402 0.6269 0.4826 1.7785 1.3676 0.9878 0.9250 1.6983 3.2855 3.0422 4.2577 6.6013 2.1131 9.7391 3.9845 15.8962 5.3363 2.3139 8.4029 85.5973 16.8052 15.1846 24.1272 13.9498 0.1240 21.6687 3.1215 0.4831 13.8209 0.7414 15.6572 15.7627 12.4496 1.3693 2.4954 1.0399 7.6137 0.3005 5.5888 0.3624 1.6602 12.5284 52.1655 341.7305 1.2064 83.1929 3.6683 17.4188 0.1647 8.2812 2.2382 34.9623 0.3164 1.9542 0.0449 0.5326 0.0226 0.1490 0.3845 0.1798 2.5745 0.3639 8.4657 28.5244 11.7037 27.0592 8.7640 0.1910 0.0579 0.0322 20.2843 1.1763 0.7165 3.5721 12.1929 19.3882 8.9257 2.0149 35.2680 198.5228 0.0180 2.8136 0.0941 18.4067 150.4736 36.7323 0.1956 8.3212 3.9979 7.4118 37.0688 2.2900 10.0348 0.0150 91.3305 31.7404 92.2952 55.1363 62.1964 5.5349 9.3209 4.5799 12.1274
temp: 298.150 k
press: 1.00000 atm
elementType: 17 17 8 8 7 6 6 6 6 6 6 6 6 6 6 6 6 1 1 1 1 1 1 1 1 1 1 1 1 1 1 1 1 1 1 1 1 1 1 1
symmnumber: 1
zpe: 875282.4 jmol-1
zpe.correction: 0.333377 hartree
zpe.thermalcorrener: 0.355876 hartree
zpe.thermalcorrenthalpy: 0.356820 hartree
zpe.thermalcorrgfe: 0.277395 hartree
zpe.sumelectzpe: -1594.939768 hartree
zpe.sumelectthermal: -1594.917270 hartree
zpe.sumelectthermalent: -1594.916325 hartree
zpe.sumelectthermalfe: -1594.995751 hartree
dipole: -1.9294 1.6152 -1.6855
dipole: 3.0286
quadrupole: -114.4534 -126.3570 -117.4121
quadrupole: 4.0049 -6.4199 -4.9741
quadrupole: 4.9541 -6.9495 1.9954 4.0049 -6.4199 -4.9741
hfenergy: -1595.2731454 hartree
pointgroup: C01 [X(C12H23Cl2N1O2)]
dipole: 0.7314813 -0.5192589 -0.7842574 debye
polarizability: 214.0751025|-15.6604721|160.105997|8.0304321|-1.6788049|151.609569 unknown
InChI: InChI=1S/C12H23Cl2NO2/c1-4-5-6-7-8-9-10-17-11(16)12(2,3)15(13)14/h4-10H2,1-3H3
charge 0 multiplicity 1
40 atoms
Cl -5.16521 2.489404 -0.219095
Cl -3.542348 1.160663 2.049722
O  -1.542673 -0.313744 -0.390248
O  -2.807813 -2.081802 0.442312
N  -3.631902 1.336939 0.120133
C  3.426251 0.246079 -0.165643
C  2.242993 -0.728225 0.032169
C  4.801686 -0.403589 0.106551
C  0.876443 -0.07271 -0.279275
C  5.982913 0.57935 -0.057985
C  -0.279774 -1.038065 -0.027676
C  7.361249 -0.072458 0.197543
C  -3.956185 -0.06326 -0.457285
C  -2.728884 -0.940208 -0.058282
C  8.53413 0.920286 0.04525
C  -5.252614 -0.723882 0.031954
C  -3.935444 0.146537 -1.996763
H  3.406645 0.641831 -1.202438
H  3.29462 1.121041 0.503971
H  2.387435 -1.616413 -0.617565
H  2.24952 -1.100498 1.077749
H  4.814048 -0.820347 1.135559
H  4.943081 -1.264874 -0.579539
H  0.852226 0.260861 -1.334455
H  0.736961 0.82859 0.347083
H  5.849083 1.434047 0.637617
H  5.965957 1.007201 -1.082395
H  -0.351554 -1.347521 1.031134
H  -0.216456 -1.947018 -0.65468
H  7.374601 -0.507717 1.217781
H  7.498501 -0.920606 -0.50395
H  8.563569 1.346127 -0.975617
H  9.507287 0.431192 0.235243
H  8.43428 1.762221 0.756136
H  -6.119354 -0.104282 -0.250595
H  -5.354173 -1.720024 -0.429661
H  -5.237533 -0.859939 1.125298
H  -4.849791 0.668357 -2.321575
H  -3.895476 -0.839841 -2.492912
H  -3.050693 0.729499 -2.298766
