program: Gaussian 09
title: 000143614
version: EM64L-G09RevD.01
frameworkgroup: C1[X(C22H26)]
method: RPBEPBE
basis: SDD
operation: Freq
keyword: #p
keyword: freq=noraman
keyword: PBEPBE/SDD
title: #p freq=noraman PBEPBE/SDD
converged: NO YES NO NO
title: Mulliken charges:
elementType: C C C C C C C C C C C C C C C C C C C C C C H H H H H H H H H H H H H H H H H H H H H H H H H H
charge: 0.254248 0.254276 -0.576805 -0.553848 -0.576716 -0.553904 -0.431067 -0.435777 -0.431084 -0.435735 0.414144 0.414202 -0.377672 -0.377763 -0.374482 -0.374504 -0.276943 -0.276964 -0.258978 -0.258987 -0.248011 -0.248006 0.220242 0.209091 0.217887 0.235127 0.220268 0.209069 0.217900 0.235082 0.234414 0.197765 0.196278 0.233221 0.234410 0.197763 0.196288 0.233233 0.222213 0.222362 0.229338 0.229332 0.222171 0.222184 0.221955 0.221952 0.225414 0.225416
chargesum: 0.00000
title: Mulliken charges with hydrogens summed into heavy atoms:
elementType: C C C C C C C C C C C C C C C C C C C C C C
charge: 0.254248 0.254276 -0.147472 -0.100834 -0.147380 -0.100922 0.001112 -0.006278 0.001090 -0.006214 0.414144 0.414202 -0.155458 -0.155401 -0.145145 -0.145172 -0.054772 -0.054780 -0.037023 -0.037035 -0.022596 -0.022590
polarizability: 2.03745416e+02 -1.94037258e-02 2.40258042e+02 -1.87141943e+01 4.10446345e-03 2.07473889e+02
1716.lowfreq: -12.8035 0.0001 0.0004 0.0007 6.7066 7.0174 22.9652 36.1288 52.7946
frequency: 22.8871 36.0367 52.7915 69.0367 77.9816 104.4774 112.4700 141.2423 153.0789 193.2821 232.6901 246.0132 248.8249 271.8967 274.4234 303.1549 363.8249 366.3172 402.6671 403.8293 416.4953 454.3967 500.3887 513.2357 541.9525 566.0888 617.0769 617.3277 629.0059 631.0904 673.8466 686.2143 703.4555 704.5472 740.1760 762.7797 780.9507 784.5487 814.8697 820.6191 824.9126 848.0611 849.1042 859.7570 888.6717 893.6140 904.9984 914.0872 937.4333 958.4327 963.6538 972.3254 973.0165 975.9694 985.2630 989.8805 990.8253 992.2798 993.7008 1027.1610 1028.4937 1031.9976 1032.1619 1038.2936 1066.3494 1073.0288 1073.4398 1083.2892 1112.3811 1123.0714 1129.7929 1135.4397 1171.3682 1172.4183 1180.7229 1185.0077 1185.1563 1202.7237 1203.3051 1204.1019 1221.5045 1222.5150 1245.6611 1253.8647 1273.8848 1279.6378 1303.5840 1306.1596 1308.2887 1309.7670 1310.4602 1321.1126 1323.0567 1324.3983 1372.6306 1374.1119 1431.1027 1431.6063 1467.0876 1467.1130 1477.2372 1478.4282 1480.0724 1482.5532 1486.9534 1487.3617 1497.0725 1502.4323 1586.1870 1586.7137 1609.4107 1610.5206 2997.6879 2997.7422 3005.4502 3005.5706 3007.6106 3010.2625 3017.2856 3019.0970 3047.3014 3047.4588 3068.7426 3068.9977 3075.0812 3078.4634 3086.5214 3086.8748 3117.1822 3117.2511 3125.9927 3126.0822 3141.2897 3141.3675 3149.3867 3149.5639 3162.2823 3162.5329
redmass: 4.4443 3.5748 4.3924 3.9787 3.6757 2.1009 2.0894 2.4459 2.9357 3.6773 3.8226 2.9321 4.2870 3.6266 2.4628 4.4270 2.4580 2.5599 2.8459 2.8137 3.1025 3.1963 2.9962 2.9728 2.9689 3.0043 5.7624 5.7298 3.0377 2.8431 3.0373 3.0339 1.6031 1.6639 2.4116 2.0120 1.5922 1.4251 1.6158 1.5421 2.4025 1.2950 1.2761 3.0076 2.8408 2.3883 1.6535 1.4808 2.1767 1.9721 2.0051 1.4503 1.4442 1.6864 1.9137 1.6690 1.8153 3.0624 2.6550 3.1750 1.7101 2.3834 1.9449 1.7860 2.5298 2.2934 2.3177 2.1408 2.1645 2.7387 1.8619 1.7894 1.0925 1.0596 1.3999 1.3172 1.5554 1.3294 1.1382 1.2144 1.1799 1.2183 1.9867 1.8906 1.3809 1.2794 1.4015 1.4138 1.4451 1.3225 1.3107 1.3405 1.2869 1.3745 6.0403 6.5120 2.2320 2.2381 1.0815 1.0773 1.3042 1.3935 1.1382 1.1928 1.3548 1.3379 1.1418 1.1419 5.7660 5.7226 6.0388 6.0254 1.0584 1.0584 1.0625 1.0644 1.0643 1.0604 1.0665 1.0664 1.1012 1.1008 1.0990 1.1000 1.0987 1.0991 1.1021 1.1018 1.0841 1.0841 1.0874 1.0874 1.0920 1.0918 1.0946 1.0946 1.1004 1.1003
irintensity: 0.0033 0.1174 0.0300 0.0004 0.2903 0.0168 0.0064 0.0014 0.0962 0.6440 0.0584 0.0363 0.1828 0.6582 0.0262 0.4560 0.0836 0.0456 0.3093 0.1084 0.0727 0.4104 11.9429 4.1567 0.2774 3.8708 0.1236 0.0001 0.0283 1.2234 8.8898 7.7197 113.0246 9.3310 47.7553 7.3955 14.4444 7.4832 0.7740 0.8650 2.8095 0.6089 0.8058 2.3917 4.2857 2.5832 0.0404 0.2648 2.9913 6.7140 3.6734 0.0804 1.5165 0.9007 0.3494 0.3821 0.2460 0.4947 0.7684 3.2577 12.1475 6.7097 1.5596 0.8892 4.1802 0.5098 0.5554 0.4697 4.0373 0.4307 3.7199 0.0747 0.6690 0.0070 5.4956 1.3517 3.4960 0.0203 1.4324 0.0280 4.1478 0.0168 7.5368 3.0886 2.6619 0.2935 9.3682 3.5640 13.5626 0.0051 0.3625 0.0003 0.0372 3.5062 0.6293 0.0863 8.7480 1.4112 0.1169 3.0004 27.0148 34.3354 13.5733 0.4069 12.3284 8.0914 0.0652 2.9268 2.3582 0.8543 4.4961 7.7224 7.2359 24.6218 124.3335 5.6512 73.8717 2.6242 31.6831 54.8094 5.4200 16.2951 27.0542 4.3339 35.7438 14.5269 140.9208 43.5385 2.4711 1.5951 0.0517 6.2594 11.0418 51.1232 0.5408 79.8900 22.2824 6.3652
temp: 298.150 k
press: 1.00000 atm
elementType: 6 6 6 6 6 6 6 6 6 6 6 6 6 6 6 6 6 6 6 6 6 6 1 1 1 1 1 1 1 1 1 1 1 1 1 1 1 1 1 1 1 1 1 1 1 1 1 1
symmnumber: 1
zpe: 1094925.5 jmol-1
zpe.correction: 0.417035 hartree
zpe.thermalcorrener: 0.436069 hartree
zpe.thermalcorrenthalpy: 0.437013 hartree
zpe.thermalcorrgfe: 0.369435 hartree
zpe.sumelectzpe: -852.319884 hartree
zpe.sumelectthermal: -852.300850 hartree
zpe.sumelectthermalent: -852.299906 hartree
zpe.sumelectthermalfe: -852.367484 hartree
dipole: -0.0002 -0.4566 0.0001
dipole: 0.4566
quadrupole: -136.7492 -124.5684 -125.8370
quadrupole: -0.0052 -4.2331 0.0018
quadrupole: -7.6977 4.4831 3.2145 -0.0052 -4.2331 0.0018
hfenergy: -852.7369187 hartree
pointgroup: C01 [X(C22H26)]
dipole: 0.0000849 -0.1796363 0.0000047 debye
polarizability: 208.7405324|0.0159162|240.2580428|-18.5443819|-0.0070205|202.4787723 unknown
InChI: InChI=1S/C22H26/c1-3-11-19(12-4-1)21(15-7-8-16-21)22(17-9-10-18-22)20-13-5-2-6-14-20/h1-6,11-14H,7-10,15-18H2
charge 0 multiplicity 1
48 atoms
C  -0.704426 -1.080721 -0.386018
C  0.704535 -1.080706 0.386269
C  -1.603442 -2.331984 -0.084942
C  -0.540952 -1.265002 -1.930901
C  1.60342 -2.332077 0.085243
C  0.541302 -1.264788 1.931208
C  -2.649907 -2.357479 -1.236164
C  -1.953077 -1.652821 -2.448815
C  2.650101 -2.357434 1.236269
C  1.953516 -1.652545 2.448924
C  -1.49236 0.215934 -0.044684
C  1.492424 0.215921 0.044708
C  -2.242304 0.319684 1.159412
C  2.240936 0.320208 -1.160233
C  -1.473436 1.355433 -0.891318
C  1.4746 1.355007 0.891925
C  -2.941153 1.498319 1.500709
C  2.939584 1.498911 -1.501715
C  -2.17191 2.537713 -0.560164
C  2.172908 2.537337 0.560602
C  -2.912635 2.618557 0.639807
C  2.912279 2.618683 -0.640171
H  -2.088496 -2.314738 0.90483
H  -0.983628 -3.246839 -0.124828
H  0.156161 -2.106073 -2.104536
H  -0.120558 -0.390189 -2.45225
H  2.088272 -2.315079 -0.904628
H  0.983555 -3.246883 0.125428
H  -0.155803 -2.105815 2.105092
H  0.121063 -0.389883 2.452523
H  -3.556776 -1.800914 -0.939193
H  -2.961788 -3.39063 -1.473818
H  -1.892336 -2.307338 -3.336978
H  -2.518856 -0.751115 -2.74405
H  3.556943 -1.800964 0.939039
H  2.961971 -3.390562 1.474037
H  1.892931 -2.3069 3.337217
H  2.519363 -0.750791 2.743888
H  -2.290917 -0.530834 1.847647
H  2.288506 -0.529897 -1.849049
H  -0.896306 1.335747 -1.820882
H  0.89849 1.334936 1.822114
H  -3.50963 1.538954 2.4373
H  3.506938 1.539968 -2.438968
H  -2.131011 3.397146 -1.239346
H  2.132915 3.396425 1.240273
H  -3.456462 3.53412 0.898688
H  3.455953 3.534295 -0.8992
