program: Gaussian 09
title: 000143607
version: EM64L-G09RevD.01
frameworkgroup: C1[X(C10H17NOS)]
method: RPBEPBE
basis: SDD
operation: Freq
keyword: #p
keyword: freq=noraman
keyword: PBEPBE/SDD
title: #p freq=noraman PBEPBE/SDD
converged: YES YES NO NO
title: Mulliken charges:
elementType: S O N C C C C C C C C C C H H H H H H H H H H H H H H H H H
charge: 0.096414 -0.239522 -0.089847 -0.334673 -0.378663 -0.338973 -0.499707 -0.694215 -0.036016 -0.583375 0.269836 -0.622209 -0.490744 0.180039 0.226701 0.218988 0.251832 0.204016 0.193145 0.249130 0.266997 0.209515 0.218453 0.216200 0.246073 0.288759 0.256084 0.222376 0.213768 0.279616
chargesum: 0.00000
title: Mulliken charges with hydrogens summed into heavy atoms:
elementType: S O N C C C C C C C C C C
charge: 0.096414 -0.239522 -0.089847 0.072067 0.092157 0.058189 0.016420 -0.050046 -0.036016 -0.048543 0.269836 0.070019 -0.211127
polarizability: 1.62122317e+02 1.06333051e+01 1.44509798e+02 4.13748016e+00 3.76777518e+00 1.03392233e+02
1716.lowfreq: -13.8441 0.0009 0.0010 0.0024 2.8735 8.4526 21.0633 27.3032 40.0575
frequency: 20.5774 26.9428 40.0491 46.4118 62.5192 65.5874 89.7966 106.7876 156.9952 176.8447 221.9150 224.9077 233.4802 266.6299 289.5429 303.7625 338.2106 360.1287 406.0708 409.3585 493.6323 529.3492 614.4449 621.2296 636.5043 669.3774 695.1201 733.9472 750.8993 788.6444 878.5952 900.1384 927.7390 933.2102 958.0453 983.9861 1022.0549 1058.9016 1070.8382 1072.7763 1106.7083 1113.5335 1175.3990 1197.8516 1245.2202 1254.2306 1266.5764 1280.8188 1289.1268 1292.4151 1335.8628 1344.8725 1362.4162 1383.9599 1389.6716 1391.2194 1426.3447 1452.5504 1462.9248 1463.5647 1468.8269 1475.6340 1476.9152 1480.3061 1487.4928 1616.6874 2143.2704 2965.6584 2972.3912 2975.2808 2982.0336 2982.5799 2999.2079 3012.3690 3034.0474 3041.9035 3042.8313 3071.1542 3075.2253 3076.0986 3081.0717 3095.1478 3120.4317 3425.4022
redmass: 3.5052 4.2820 2.8029 4.5395 2.6226 2.1178 5.8610 2.4067 3.7201 1.7370 1.4475 2.2708 2.3683 1.7845 4.8947 2.7401 3.3342 2.3870 3.9825 5.0369 5.1534 6.2586 5.5046 10.7410 1.2314 1.3865 3.0737 1.1025 1.1934 1.2455 3.9186 1.7672 1.5006 2.9138 1.9525 1.7429 3.7773 1.3180 2.3384 2.5098 2.0400 2.2988 2.0476 1.8848 1.5671 1.1955 1.2733 1.2067 1.0766 1.2960 1.2650 1.4197 1.3875 2.0985 1.2091 1.2142 1.1014 1.0822 1.0763 1.0584 1.0722 1.0489 1.0555 1.0456 1.0844 8.3367 5.9773 1.0597 1.0626 1.0366 1.0632 1.0375 1.0652 1.0958 1.0591 1.0989 1.0970 1.1006 1.0996 1.0958 1.1025 1.1015 1.1058 1.1601
irintensity: 0.0601 0.0981 0.1546 2.8463 0.1402 0.2473 1.6734 0.0840 0.4238 3.8981 0.9851 0.4292 2.7925 2.8680 16.0166 0.8108 3.4874 13.6612 3.1154 6.7749 1.4727 14.6243 8.3898 10.2998 69.9411 49.8860 53.1113 19.7431 5.5725 2.3878 15.2513 13.9434 1.0810 22.8417 97.8511 20.2544 2.4173 0.6942 10.9098 0.6619 56.9161 8.2760 215.7428 33.8815 7.0761 3.3869 0.4850 19.6230 1.2970 35.2282 12.0945 4.6681 5.9002 103.3753 19.1798 12.6442 28.1271 32.8535 11.8505 10.0155 3.5809 11.6405 6.3005 8.1094 19.7473 256.1162 0.6188 8.0775 43.9464 38.4904 29.8441 32.8515 28.5461 8.7228 20.6241 19.5302 3.2943 49.7594 51.0909 32.7377 35.9857 6.4325 16.0216 64.7601
temp: 298.150 k
press: 1.00000 atm
elementType: 16 8 7 6 6 6 6 6 6 6 6 6 6 1 1 1 1 1 1 1 1 1 1 1 1 1 1 1 1 1
symmnumber: 1
zpe: 655094.1 jmol-1
zpe.correction: 0.249512 hartree
zpe.thermalcorrener: 0.266407 hartree
zpe.thermalcorrenthalpy: 0.267351 hartree
zpe.thermalcorrgfe: 0.201853 hartree
zpe.sumelectzpe: -918.209189 hartree
zpe.sumelectthermal: -918.192294 hartree
zpe.sumelectthermalent: -918.191350 hartree
zpe.sumelectthermalfe: -918.256848 hartree
dipole: 1.3869 1.2313 -0.5608
dipole: 1.9376
quadrupole: -79.5956 -85.6851 -86.8196
quadrupole: 3.5345 0.2400 3.2780
quadrupole: 4.4378 -1.6517 -2.7862 3.5345 0.2400 3.2780
hfenergy: -918.4587013 hartree
pointgroup: C01[X(C10H17N1O1S1)]
dipole: 0.5370411 -0.4945793 0.2192452 debye
polarizability: 159.9492794|-11.792708|146.1629689|-7.6967343|1.3638286|103.9120992 unknown
InChI: InChI=1S/C10H17NOS/c1-4-7-9-11(8-5-2)10(12)13-6-3/h2H,4,6-9H2,1,3H3
charge 0 multiplicity 1
30 atoms
S  -2.478647 0.289023 1.266485
O  -0.859478 1.672115 -0.493522
N  0.056473 -0.310262 0.32144
C  2.425596 0.570743 0.243091
C  1.278741 -0.142341 -0.507731
C  3.699876 0.682671 -0.624991
C  -0.013042 -1.506662 1.187154
C  4.857478 1.391896 0.109887
C  -0.942483 0.639999 0.225821
C  -3.465581 1.828171 0.75861
C  -0.2803 -2.760114 0.447464
C  -4.240222 1.619396 -0.547987
C  -0.485822 -3.812379 -0.160127
H  2.666819 0.022097 1.177004
H  2.084096 1.580534 0.54054
H  1.597532 -1.148788 -0.841333
H  0.998015 0.441568 -1.40083
H  3.458874 1.234149 -1.556105
H  4.024445 -0.331471 -0.936604
H  0.951051 -1.603128 1.724217
H  -0.787473 -1.356579 1.960638
H  5.13956 0.844457 1.029034
H  5.756287 1.464329 -0.529296
H  4.56887 2.417838 0.405337
H  -4.125419 2.023424 1.620605
H  -2.726693 2.640144 0.661642
H  -3.541809 1.433289 -1.380921
H  -4.938992 0.767913 -0.474811
H  -4.825613 2.528327 -0.787828
H  -0.681537 -4.725258 -0.692885
