program: Gaussian 09
title: 000143598
version: EM64L-G09RevD.01
frameworkgroup: C1[X(C11H18SSi)]
method: RPBEPBE
basis: SDD
operation: Freq
keyword: #p
keyword: freq=noraman
keyword: PBEPBE/SDD
title: #p freq=noraman PBEPBE/SDD
converged: YES YES NO NO
title: Mulliken charges:
elementType: S Si C C C C C C C C C C C H H H H H H H H H H H H H H H H H H
charge: 0.171945 1.248859 -0.942245 -1.012528 -1.022009 -1.022759 0.513777 -0.384014 -0.383234 -0.236060 -0.226815 -0.227242 -0.842253 0.240735 0.240827 0.233494 0.233504 0.236685 0.237308 0.228961 0.252920 0.252509 0.228835 0.237550 0.230855 0.230065 0.251700 0.249940 0.263398 0.262547 0.252747
chargesum: 0.00000
title: Mulliken charges with hydrogens summed into heavy atoms:
elementType: S Si C C C C C C C C C C C
charge: 0.171945 1.248859 -0.460683 -0.308845 -0.302821 -0.303866 0.513777 -0.153159 -0.153169 0.015640 0.023124 -0.227242 -0.063561
polarizability: 2.20953488e+02 1.49648334e+01 1.29695903e+02 8.68664006e+00 -8.49937980e+00 1.35354650e+02
1716.lowfreq: -14.2592 -7.0874 -0.0019 -0.0012 0.0015 3.7303 15.3508 22.5397 40.1334
frequency: 12.9768 21.3543 40.1281 45.0080 97.5462 117.5593 130.7242 137.3145 155.0224 159.4144 161.6791 171.1609 208.8570 212.6700 240.4437 247.7192 348.5401 356.4034 379.4607 408.3895 509.9261 576.3657 615.4594 630.4633 642.9444 671.1029 690.5481 693.8753 729.2574 732.1358 738.1673 792.0226 810.8691 842.6708 853.8611 856.7449 906.0852 907.1486 919.4422 959.2989 962.2018 974.4624 986.1634 1002.2834 1077.2609 1079.9508 1131.8411 1168.0442 1184.4432 1214.7913 1290.4320 1291.9363 1293.2248 1306.1528 1337.3509 1363.2700 1394.9085 1442.3527 1443.4457 1443.7987 1448.1203 1448.4779 1455.0766 1457.3466 1460.2670 1464.3745 1475.9842 1567.8942 1599.2147 2978.3348 2979.3363 2980.4505 2983.4984 3006.0460 3045.7696 3079.7986 3080.6377 3082.5795 3083.2933 3086.2018 3087.5797 3118.6641 3121.2107 3128.9943 3131.0287 3148.0297 3153.6681
redmass: 2.9223 3.5121 4.1642 3.4873 3.6408 1.0293 1.0472 1.0668 1.3130 2.3357 2.0979 3.4934 2.8030 2.6075 3.2253 3.2458 4.7813 2.3751 7.4372 2.8773 3.3566 3.3115 4.9030 6.4994 6.7438 4.0671 3.5576 3.2058 1.3004 3.0800 1.1731 2.0370 2.0792 1.3159 1.6420 1.3703 1.5642 1.5819 1.5731 1.3223 1.1843 1.3731 1.2865 4.0547 2.8155 1.3860 1.1201 1.2790 1.1114 3.3996 1.2852 1.2064 1.2170 1.1899 1.1314 4.6718 3.1698 1.0549 1.0577 1.0782 1.0566 1.0752 1.0509 1.0537 1.0567 1.0488 2.4365 6.9513 6.2923 1.0344 1.0343 1.0349 1.0574 1.0278 1.1012 1.0985 1.0982 1.0980 1.0978 1.0985 1.0980 1.0884 1.0884 1.1059 1.1037 1.0954 1.0965
irintensity: 0.3592 1.5323 0.1248 0.2827 0.6188 0.0163 0.0161 0.0537 0.0780 0.1828 0.1526 0.2924 1.0251 2.2807 3.6855 1.6519 0.8600 0.1311 1.5944 0.0228 27.7980 14.8134 0.2519 0.0477 0.3330 12.4487 8.1617 8.2115 0.0138 0.8032 0.0096 2.9890 11.4043 4.5640 33.9863 1.5366 85.6126 84.0126 246.7509 1.7031 6.0124 0.0519 25.2136 11.2461 1.1031 20.6239 0.1925 60.5828 3.2671 38.1928 9.2843 35.4322 42.5236 17.0795 0.5962 1.9430 4.4925 0.1044 19.1046 1.5397 1.2751 2.6137 8.0439 10.5452 10.8280 18.0225 60.0835 0.0656 16.0568 17.0934 17.9357 10.0372 24.3555 32.5958 8.2214 1.5458 3.2462 27.7646 35.8105 7.7196 34.4690 9.2060 20.0395 17.9872 16.6037 19.4675 0.8860
temp: 298.150 k
press: 1.00000 atm
elementType: 16 14 6 6 6 6 6 6 6 6 6 6 6 1 1 1 1 1 1 1 1 1 1 1 1 1 1 1 1 1 1
symmnumber: 1
zpe: 668538.8 jmol-1
zpe.correction: 0.254633 hartree
zpe.thermalcorrener: 0.272136 hartree
zpe.thermalcorrenthalpy: 0.273080 hartree
zpe.thermalcorrgfe: 0.206629 hartree
zpe.sumelectzpe: -1116.444364 hartree
zpe.sumelectthermal: -1116.426861 hartree
zpe.sumelectthermalent: -1116.425917 hartree
zpe.sumelectthermalfe: -1116.492368 hartree
dipole: -2.4658 1.2980 0.6028
dipole: 2.8511
quadrupole: -99.2242 -94.1095 -92.3919
quadrupole: 7.3431 3.6131 -2.1705
quadrupole: -3.9823 1.1324 2.8500 7.3431 3.6131 -2.1705
hfenergy: -1116.6989971 hartree
pointgroup: C01 [X(C11H18S1Si1)]
dipole: -0.9732866 0.3125264 -0.4617666 debye
polarizability: 220.7152289|12.167568|132.4932834|-13.224552|8.8155376|132.7955282 unknown
InChI: InChI=1S/C11H18SSi/c1-12-11-7-5-10(6-8-11)9-13(2,3)4/h5-8H,9H2,1-4H3
charge 0 multiplicity 1
31 atoms
S  4.264945 0.12989 0.118088
Si -2.942514 0.276867 -0.236271
C  -1.832968 -0.766628 0.976532
C  -4.774688 -0.133637 0.147914
C  -2.614733 2.140793 0.052342
C  -2.529878 -0.193007 -2.04491
C  -0.346693 -0.558095 0.777976
C  0.352623 0.463098 1.478061
C  0.392106 -1.360327 -0.135066
C  1.733035 0.68113 1.271189
C  1.773233 -1.151822 -0.343177
C  2.449076 -0.123586 0.354674
C  4.226213 1.238957 -1.417176
H  -2.104717 -1.830488 0.831528
H  -2.134976 -0.494405 2.006748
H  -4.981906 -1.209951 0.001472
H  -5.029908 0.123698 1.192655
H  -5.453367 0.434288 -0.515218
H  -3.183772 2.756319 -0.668988
H  -2.919822 2.445921 1.070669
H  -1.542074 2.377397 -0.069268
H  -1.457649 -0.034579 -2.260146
H  -2.767035 -1.254087 -2.247484
H  -3.114682 0.424341 -2.751886
H  -0.187964 1.088803 2.198935
H  -0.118246 -2.165018 -0.678631
H  2.259529 1.465741 1.825108
H  2.332029 -1.793452 -1.033225
H  3.699321 2.178216 -1.189864
H  3.732253 0.712637 -2.24826
H  5.276725 1.447688 -1.675421
