program: Gaussian 09
title: 000143595
version: EM64L-G09RevD.01
frameworkgroup: C1[X(C4H6O)]
method: RPBEPBE
basis: SDD
operation: Freq
keyword: #p
keyword: freq=noraman
keyword: PBEPBE/SDD
title: #p freq=noraman PBEPBE/SDD
converged: NO NO NO NO
title: Mulliken charges:
elementType: O C C C C H H H H H H
charge: -0.446382 0.336266 -0.211511 -0.642256 -0.524419 0.219969 0.231573 0.232840 0.220327 0.232972 0.350621
chargesum: 0.00000
title: Mulliken charges with hydrogens summed into heavy atoms:
elementType: O C C C C
charge: -0.095762 0.336266 0.008459 -0.177844 -0.071120
polarizability: 6.23808032e+01 3.61486826e+00 5.55422455e+01 2.24552365e+00 -1.81018838e+00 2.50424530e+01
1716.lowfreq: -8.9759 -5.6738 -0.0004 -0.0004 -0.0004 7.8823 113.5887 255.3061 300.8434
frequency: 113.5377 255.3018 300.8410 392.2646 433.1425 549.3161 696.8381 722.3203 805.3129 867.1079 932.1729 953.5819 986.7736 1063.2653 1184.1556 1225.2090 1294.9465 1397.2911 1430.7834 1639.7389 1665.2222 3075.6851 3105.1589 3132.5693 3212.3589 3248.7053 3576.8683
redmass: 2.2695 2.5940 1.1448 1.8386 2.8309 2.8034 1.1331 1.8547 3.0106 1.3966 1.8451 1.3500 1.1242 1.5251 1.3123 2.2231 1.4354 1.1517 1.2345 4.7898 5.1331 1.0833 1.0676 1.0610 1.1156 1.1164 1.0663
irintensity: 0.2332 4.4112 139.0629 15.5844 4.7735 9.1850 7.2622 12.1872 26.7661 105.9956 31.2398 77.2267 23.2644 7.3001 42.0907 183.4519 6.9188 3.1891 39.3920 3.9398 47.4530 20.0369 3.0692 0.0722 16.6782 5.4470 24.5884
temp: 298.150 k
press: 1.00000 atm
elementType: 8 6 6 6 6 1 1 1 1 1 1
symmnumber: 1
zpe: 228848.4 jmol-1
zpe.correction: 0.087164 hartree
zpe.thermalcorrener: 0.092968 hartree
zpe.thermalcorrenthalpy: 0.093912 hartree
zpe.thermalcorrgfe: 0.058548 hartree
zpe.sumelectzpe: -230.803974 hartree
zpe.sumelectthermal: -230.798169 hartree
zpe.sumelectthermalent: -230.797225 hartree
zpe.sumelectthermalfe: -230.832590 hartree
dipole: -1.9083 -1.1503 -0.2844
dipole: 2.2463
quadrupole: -31.7317 -24.7752 -33.0684
quadrupole: 0.0691 -0.6147 -0.2681
quadrupole: -1.8733 5.0832 -3.2100 0.0691 -0.6147 -0.2681
hfenergy: -230.8911375 hartree
pointgroup: C01 [X(C4H6O1)]
dipole: -0.7544215 -0.4521369 -0.0861762 debye
dipolederiv: -0.5864692 0.6347063 0.0531224 0.3306821 -0.7986744 0.0445314 0.0693468 0.0813227 -0.4380706 0.5245177 -0.5345275 -0.0707921 -0.3804038 0.9170495 0.043508 -0.0801281 0.0607536 0.0462926 0.0444088 0.2128235 0.0595788 0.1845026 0.0025552 -0.1619492 0.0659481 -0.175732 -0.0218873 -0.1142923 -0.0934593 -0.096218 0.0225767 -0.4308898 0.0119665 -0.0797583 0.0124733 -0.4665372 -0.1482584 -0.0100734 -0.0254215 0.0623775 -0.0693823 -0.2133083 -0.0804185 -0.2137879 -0.2242669 0.0472494 0.003773 -0.0159151 -0.0378662 -0.060313 0.1326208 -0.0042804 0.1321684 0.081217 -0.0414738 -0.0341168 0.0498671 -0.0448269 0.0886315 0.0042574 0.0766825 0.016272 0.2215773 -0.0087712 0.0847949 0.0391487 0.0643514 0.0346315 -0.0178346 0.0245982 -0.0283123 0.185801 -0.0724885 -0.0707897 0.0280288 -0.0629329 0.102344 0.0648049 0.0521295 0.0753377 0.1443693 0.0807189 -0.0363417 0.012898 -0.0096921 0.0041112 0.1353709 -0.0017696 0.1161268 0.0967723 0.2748587 -0.1567891 -0.0342971 -0.1287682 0.2099367 -0.0439678 -0.0423502 -0.0766223 0.3747325 unknown
polarizability: 62.3841905|3.7916389|54.9204958|2.5454184|-4.3569519|25.6608153 unknown
InChI: InChI=1S/C4H6O/c1-3-4(2)5/h3,5H,1-2H2
charge 0 multiplicity 1
11 atoms
O  1.535962 -0.917006 -0.005207
C  0.490533 0.044008 0.065338
C  -0.868234 -0.504314 0.28639
C  0.823709 1.361252 -0.013471
C  -2.018251 0.032751 -0.203587
H  -0.922948 -1.416919 0.901899
H  1.858812 1.662825 -0.193039
H  0.067319 2.132951 0.142353
H  -2.99456 -0.406379 0.027234
H  -2.00595 0.921725 -0.844198
H  1.166608 -1.815094 -0.19551
