program: Gaussian 09
title: 000143583
version: EM64L-G09RevD.01
frameworkgroup: C1[X(C9H10)]
method: RPBEPBE
basis: SDD
operation: Freq
keyword: #p
keyword: freq=noraman
keyword: PBEPBE/SDD
title: #p freq=noraman PBEPBE/SDD
converged: NO NO NO NO
title: Mulliken charges:
elementType: C C C C C C C C C H H H H H H H H H H
charge: -0.310243 -0.202454 -0.111674 -0.498243 -0.207888 -0.257389 -0.285561 -0.255113 -0.236211 0.292303 0.239846 0.211114 0.224952 0.222621 0.228761 0.236727 0.240397 0.236606 0.231451
chargesum: 0.00000
title: Mulliken charges with hydrogens summed into heavy atoms:
elementType: C C C C C C C C C
charge: -0.017940 0.037392 0.099440 -0.050671 0.020873 -0.020662 -0.045164 -0.018508 -0.004760
polarizability: 1.00227349e+02 -6.24313105e+00 9.08431639e+01 -1.08709501e+00 5.85904835e-01 6.36754675e+01
1716.lowfreq: -35.9535 -24.8746 -19.2499 -0.0007 -0.0004 0.0004 241.6106 318.1539 342.8006
frequency: 241.6089 318.1518 342.7990 430.2553 453.8581 546.8844 607.5293 655.2607 685.8385 709.6874 772.3182 795.4473 817.7114 863.5893 873.0761 898.8651 907.4222 922.0202 931.0878 949.1258 979.0463 992.5993 1025.1289 1064.8223 1074.5470 1107.6095 1135.1142 1143.4025 1144.6822 1193.5130 1219.5995 1233.2004 1249.3065 1256.2426 1274.3069 1293.1647 1334.6636 1455.8973 1475.8348 1506.3064 1545.3936 2945.2996 3005.6454 3012.6762 3045.5561 3077.1964 3098.4776 3125.9137 3144.9072 3159.7327 3177.2296
redmass: 2.8562 2.5308 2.7405 3.2256 2.8286 3.1222 3.7820 2.9837 1.8115 1.5748 2.6984 3.6498 2.5093 3.3211 2.2670 2.3389 1.4883 2.3677 1.6617 1.9885 1.5254 2.0866 1.5963 1.3572 1.1162 1.2585 1.4039 1.7470 1.9012 1.3433 1.3506 2.2562 1.5352 1.4423 1.7513 1.4267 1.7793 1.1052 1.0659 5.5576 6.0512 1.0770 1.0855 1.0578 1.0871 1.0912 1.1098 1.0862 1.0869 1.1038 1.1057
irintensity: 1.3387 4.5889 1.2552 3.5096 3.2879 7.4542 1.6937 15.8602 41.0882 41.1404 5.2003 8.5519 6.1189 6.9249 9.8496 11.6251 2.8698 1.4343 0.7534 1.4792 9.6128 9.4959 0.8765 1.5310 3.8778 5.1492 2.3713 11.1395 10.0706 3.1855 1.1623 2.9902 5.3326 1.5395 4.4681 1.5816 2.2791 0.8700 10.5365 6.9198 3.1795 4.2368 47.1237 57.8107 44.8261 29.5594 42.0223 6.4900 4.0369 42.3757 39.3206
temp: 298.150 k
press: 1.00000 atm
elementType: 6 6 6 6 6 6 6 6 6 1 1 1 1 1 1 1 1 1 1
symmnumber: 1
zpe: 420006.2 jmol-1
zpe.correction: 0.159972 hartree
zpe.thermalcorrener: 0.166313 hartree
zpe.thermalcorrenthalpy: 0.167257 hartree
zpe.thermalcorrgfe: 0.129849 hartree
zpe.sumelectzpe: -348.154328 hartree
zpe.sumelectthermal: -348.147987 hartree
zpe.sumelectthermalent: -348.147043 hartree
zpe.sumelectthermalfe: -348.184451 hartree
dipole: 0.2735 0.1397 -0.0447
dipole: 0.3103
quadrupole: -51.5120 -53.1348 -53.6952
quadrupole: -1.4360 0.0121 -0.6031
quadrupole: 1.2687 -0.3541 -0.9145 -1.4360 0.0121 -0.6031
hfenergy: -348.3142999 hartree
pointgroup: C01 [X(C9H10)]
dipole: 0.1171138 -0.0284813 0.019508 debye
dipolederiv: -0.0268875 0.0423843 0.0637052 0.0183819 -0.0547665 -0.1822306 0.0389115 -0.0885772 0.037199 -0.0152613 -0.0575107 -0.167014 -0.0760988 0.0225547 0.0380071 -0.1565322 0.0424856 0.0859889 -0.1259225 -0.0158673 0.0627044 0.1347281 -0.0722067 -0.085664 -0.0602987 -0.1047498 -0.0501516 0.0927784 0.0547456 0.0764475 0.0966538 0.1400514 0.0090526 0.0866354 -0.0031589 0.2385275 -0.0652106 -0.03744 0.0304597 -0.0455572 0.0535199 0.1405288 -0.0019475 0.1722996 0.1567558 -0.0352739 0.0738935 0.1240728 0.0386521 0.0157934 -0.1391366 0.1614789 -0.1794668 -0.0840554 0.2166368 0.1501721 -0.0480054 0.0984842 -0.0450546 0.060816 0.0130874 0.1514666 -0.1307531 0.0397914 0.0010431 0.1159917 0.0601866 -0.0484065 -0.1418928 0.1865078 -0.2128509 -0.0864979 0.0879517 -0.0200239 -0.0865287 -0.11583 -0.0308598 0.0605141 -0.1602699 0.0102735 -0.2889449 0.047486 0.0214172 -0.0788816 0.0115406 0.0173817 0.1064554 -0.0517274 0.0750795 -0.0738884 -0.1104165 0.0050822 0.1179561 -0.0028537 0.0356446 0.0213968 0.1517307 0.0358873 -0.0190172 -0.0211645 -0.0955356 -0.056626 -0.0777363 0.0283778 0.0913074 -0.0277118 0.074751 -0.021152 0.005252 -0.0715856 -0.065266 -0.0593449 -0.0335235 -0.0713986 -0.1033724 -0.1456144 -0.0851874 0.0457574 -0.0154321 -0.0104209 -0.0473587 -0.0869976 0.0913528 0.0387765 0.1535742 -0.0594329 0.0250991 -0.0279305 -0.0374523 -0.0052717 -0.0749515 -0.1298688 -0.0543282 -0.1480975 -0.0487686 -0.0368935 0.0331159 -0.1235671 0.0063054 0.0881366 0.0670595 -0.1515765 0.0985467 0.0495637 -0.0900768 0.0603819 0.0792414 0.0661971 0.072834 -0.0548991 0.1074008 -0.0711417 0.1523522 0.0750575 -0.0194503 -0.0307721 0.0045687 -0.0469159 0.1298612 -0.0536723 0.1587334 0.0592181 -0.1087032 -0.0814596 0.0339552 -0.1056472 0.0193884 -0.0112612 0.036908 -0.0194403 0.1682441 unknown
polarizability: 96.9341402|7.6961319|94.136882|1.1232416|0.2301383|63.674958 unknown
InChI: InChI=1S/C9H10/c1-3-7-5-8-4-2-6(1)9(7)8/h1-4,6-9H,5H2
charge 0 multiplicity 1
19 atoms
C  0.052782 0.201524 -0.910473
C  1.505507 0.457095 -0.434817
C  -0.412816 1.059822 0.296822
C  0.936661 1.880191 0.131488
C  -0.559474 -1.148009 -0.533194
C  1.637159 -0.759629 0.503538
C  -1.912005 0.718698 0.336872
C  0.554231 -1.606971 0.457246
C  -1.947405 -0.616578 -0.005851
H  -0.251377 0.644772 -1.870727
H  2.337751 0.535674 -1.154238
H  -0.101405 0.503577 1.204133
H  1.372419 2.310647 1.047948
H  0.962385 2.617134 -0.690986
H  -0.702205 -1.898971 -1.332538
H  2.517582 -0.934212 1.1332
H  -2.752197 1.307925 0.715408
H  0.471031 -2.524494 1.050948
H  -2.837424 -1.252496 0.043721
