program: Gaussian 09
title: 000143566
version: EM64L-G09RevD.01
frameworkgroup: C1[X(C5H10N4)]
method: RPBEPBE
basis: SDD
operation: Freq
keyword: #pfreq=noraman
keyword: PBEPBE/SDD
title: #p freq=noraman PBEPBE/SDD
converged: YES YES NO NO
title: Mulliken charges:
elementType: N N N N C C C C C H H H H H H H H H H
charge: -0.087774 -0.120489 -0.156718 -0.609264 -0.328062 -0.347135 -0.674824 -0.184249 0.067193 0.203491 0.229530 0.205706 0.239890 0.207638 0.225936 0.213171 0.265054 0.322362 0.328545
chargesum: 0.00000
title: Mulliken charges with hydrogens summed into heavy atoms:
elementType: N N N N C C C C C
charge: -0.087774 -0.120489 -0.156718 0.041642 0.104959 0.098460 -0.028079 0.080805 0.067193
polarizability: 1.07982896e+02 5.33224903e+00 7.85502986e+01 5.75619214e+00 -3.39288946e+00 5.23961049e+01
1716.lowfreq: -9.0449 -4.4355 -0.0001 0.0007 0.0007 0.4918 48.1461 77.3835 87.0402
frequency: 48.1128 77.3751 87.0362 220.0850 244.8048 281.6978 302.3167 322.4235 376.0991 387.7440 425.7250 601.0254 675.7823 721.1668 751.0558 775.3930 792.5761 867.2947 893.6498 942.1088 963.9031 1025.4380 1050.7160 1100.0144 1114.2376 1184.7537 1208.5362 1267.4392 1302.4612 1306.4485 1313.1254 1361.4561 1389.3130 1394.0775 1438.2053 1463.8133 1476.8991 1479.6656 1488.2668 1553.1230 1624.0465 2976.1596 2995.8281 3004.9558 3045.1016 3061.9223 3081.7626 3084.2500 3237.9466 3589.2823 3741.1822
redmass: 3.1607 1.8521 4.2872 1.1146 3.5084 2.6383 3.5510 1.2096 2.1096 1.4838 2.8915 4.0545 4.7543 10.3127 1.1103 4.8276 1.3982 1.2493 1.8774 4.6592 3.3610 2.5044 2.8655 1.9492 2.1034 1.8740 1.7139 1.3841 1.3541 1.5241 5.3131 1.4172 2.3095 1.4414 2.8072 1.2689 1.0465 1.0427 1.0875 1.9424 2.0976 1.0362 1.0609 1.0599 1.0989 1.1027 1.0986 1.1041 1.0995 1.0443 1.1057
irintensity: 0.0298 0.0269 0.6604 0.0658 10.5250 5.4700 4.6745 351.2872 3.2264 2.7650 7.2360 5.4862 6.1275 10.6755 7.4527 4.0532 26.7647 1.0811 15.1209 4.5265 26.5419 3.6073 0.4079 6.5094 1.9013 46.1513 3.3486 1.4685 1.0777 0.9399 20.5734 8.5378 4.4816 9.1206 42.2548 6.0127 3.6343 11.7693 17.8775 89.1808 454.2691 34.5733 3.0822 58.7808 4.5251 2.4052 39.8396 68.8491 1.5769 82.2009 48.0328
temp: 298.150 k
press: 1.00000 atm
elementType: 7 7 7 7 6 6 6 6 6 1 1 1 1 1 1 1 1 1 1
symmnumber: 1
zpe: 413416.3 jmol-1
zpe.correction: 0.157462 hartree
zpe.thermalcorrener: 0.166991 hartree
zpe.thermalcorrenthalpy: 0.167935 hartree
zpe.thermalcorrgfe: 0.122336 hartree
zpe.sumelectzpe: -414.822978 hartree
zpe.sumelectthermal: -414.813449 hartree
zpe.sumelectthermalent: -414.812505 hartree
zpe.sumelectthermalfe: -414.858104 hartree
dipole: 1.8598 -0.2781 0.1995
dipole: 1.8910
quadrupole: -46.7640 -51.3676 -56.4189
quadrupole: 9.0151 0.0859 0.9329
quadrupole: 4.7528 0.1492 -4.9021 9.0151 0.0859 0.9329
hfenergy: -414.9804403 hartree
pointgroup: C01 [X(C5H10N4)]
dipole: -0.7309547 0.1280016 0.0530794 debye
dipolederiv: -0.7499959 0.1665877 0.0589169 0.0666386 -0.031194 0.0110366 0.096714 -0.0086452 -0.1429283 -0.5260823 -0.2074272 0.0795402 0.4465566 -0.3279709 -0.0725185 0.0265783 0.0437721 -0.2155149 -0.8126704 0.0681985 0.0677391 -0.4481215 -0.5042846 0.0921824 0.1531955 -0.0004134 -0.2774333 -1.0811187 -0.4793707 0.0734622 -0.6603499 -0.4988369 0.115742 0.1130828 0.0951544 -0.7885563 0.6671334 -0.0461855 -0.046338 -0.016387 0.2130795 0.0174959 -0.1022932 0.0147902 0.2654114 -0.0376939 0.0071495 0.0329054 0.0111228 0.1106466 0.0384762 0.0469981 0.042874 0.0478529 -0.0621785 0.0280724 0.0011045 0.0534715 0.1008486 0.0055359 -0.0725775 0.0171849 0.058765 0.7387781 -0.1887158 -0.1399192 -0.2663222 0.1283316 0.0127969 -0.1697512 0.0262032 -0.062937 1.2386347 0.6798155 -0.2695084 0.8627185 0.6617613 -0.1749818 -0.292433 -0.1804077 0.2072971 -0.0029026 -0.01262 0.0174854 -0.0629391 -0.102875 0.0927312 0.0061183 0.0420335 0.0647518 -0.0193885 0.0185758 0.0146632 0.072473 0.0144536 -0.1241997 0.0508674 -0.0703494 -0.0641309 0.0378004 0.0467652 0.0261231 0.0394871 -0.0229463 -0.1303047 0.0119275 -0.0921156 -0.0808791 0.0435319 -0.07549 0.0276554 -0.0684751 -0.0587358 0.0712531 0.0193013 0.0416258 0.0570582 0.019963 -0.05359 0.0309249 -0.1262311 -0.1231153 0.0701964 0.0664004 0.0624763 0.0711521 -0.0498797 0.0519983 -0.093608 0.0690837 0.0708427 0.0696722 -0.1301779 0.0731235 -0.0597861 0.0644318 -0.0013217 0.0092963 0.030545 -0.0134832 -0.1294174 0.0720555 -0.1376498 -0.0658605 0.0828669 -0.0569375 0.0306505 -0.0674087 0.0184065 0.0237331 0.0329686 0.0215599 0.1887014 0.1854688 0.0369296 0.0470665 0.0598267 0.1995891 -0.0009459 0.0443178 0.0004707 0.3963133 0.2633016 0.0175659 0.0318401 0.0043114 0.1654825 0.011516 0.0267071 0.0083126 0.4007232 unknown
polarizability: 107.8936716|3.5520359|78.4746403|-7.3725429|-3.6090212|52.5609878 unknown
InChI: InChI=1S/C5H10N4/c1-2-3-9-4-7-5(6)8-9/h4H,2-3,6H2,1H3
charge 0 multiplicity 1
19 atoms
N  -0.131132 -0.347831 0.375967
N  0.624803 0.821067 0.13861
N  1.94227 -1.101039 -0.047248
N  2.97052 1.069023 -0.396024
C  -1.567821 -0.237921 0.652788
C  -2.375329 0.272107 -0.561714
C  -3.87263 0.424558 -0.221969
C  0.66973 -1.457201 0.256865
C  1.867822 0.294976 -0.108944
H  -1.922438 -1.238717 0.962522
H  -1.704816 0.450826 1.507091
H  -2.243691 -0.429768 -1.40764
H  -1.949333 1.241499 -0.877824
H  -4.321603 -0.541717 0.076892
H  -4.436696 0.800715 -1.093767
H  -4.023509 1.139194 0.608967
H  0.317658 -2.476443 0.394709
H  2.892156 2.07965 -0.424881
H  3.86004 0.609822 -0.558898
