program: Gaussian 09
title: 000143564
version: EM64L-G09RevD.01
frameworkgroup: C1[X(C10H12S2)]
method: RPBEPBE
basis: SDD
operation: Freq
keyword: #pfreq=noraman
keyword: PBEPBE/SDD
title: #p freq=noraman PBEPBE/SDD
converged: YES YES NO NO
title: Mulliken charges:
elementType: S S C C C C C C C C C C H H H H H H H H H H H H
charge: 0.237642 0.237639 -0.434038 -0.342547 -0.582427 -0.102172 -0.102101 -0.657456 -0.277499 -0.277502 -0.229590 -0.229606 0.216284 0.216345 0.223344 0.223270 0.254731 0.231658 0.231205 0.211425 0.245225 0.245237 0.230462 0.230471
chargesum: 0.00000
title: Mulliken charges with hydrogens summed into heavy atoms:
elementType: S S C C C C C C C C C C
charge: 0.237642 0.237639 -0.434038 0.090082 0.118918 -0.102172 -0.102101 0.016832 -0.032274 -0.032266 0.000872 0.000865
polarizability: 1.97322342e+02 -2.85917815e-02 1.32594237e+02 -6.10073907e+00 -5.22406369e-02 8.60569993e+01
1716.lowfreq: -11.3743 -0.0021 0.0007 0.0015 6.8333 15.5230 55.4173 98.0234 129.2564
frequency: 54.8378 98.0146 129.2560 179.4381 200.4101 226.2818 243.3073 260.0852 290.5334 293.6580 356.6977 390.3698 422.7793 433.4282 446.3170 490.8782 500.9439 506.4654 599.3598 656.0052 699.9455 709.4754 748.2512 801.0869 855.6851 857.0723 934.4205 974.7153 999.9663 1003.8340 1023.9650 1025.9242 1038.3879 1108.2570 1118.7068 1118.8280 1126.2706 1172.1235 1179.9179 1255.5156 1268.6719 1331.7699 1370.6622 1387.1058 1395.6657 1417.7722 1436.6309 1444.9347 1457.5543 1462.4263 1467.7439 1486.1731 1573.5137 1574.7330 2970.5041 2978.2338 2992.0573 3021.1639 3072.8769 3087.9244 3097.3871 3097.9238 3132.8758 3142.3945 3154.3042 3169.7524
redmass: 4.6479 2.1328 3.5454 1.8448 3.5662 4.8613 1.4818 1.1682 2.7948 4.8162 4.4905 5.1643 3.4969 4.8852 8.4572 5.0216 4.9564 4.1775 3.4873 6.6386 5.2794 5.3403 1.2103 1.2456 2.0936 1.3280 1.3803 1.3171 1.4127 4.7595 2.7277 1.4319 4.2058 2.7232 2.6395 1.6288 1.7193 1.0972 2.5515 1.4049 1.1577 1.5201 8.6454 1.1941 1.2020 2.0721 2.3500 1.0658 1.0653 1.0458 1.0388 1.0511 6.6295 6.2407 1.0575 1.0378 1.0363 1.1007 1.0997 1.0995 1.1001 1.0991 1.0850 1.0896 1.0950 1.1009
irintensity: 1.1376 0.0092 0.0498 1.0072 1.2450 2.6724 0.3975 0.6634 0.5098 0.8895 0.0817 0.8632 7.7613 1.5064 0.7532 5.9179 8.6799 0.1365 0.9831 13.2084 0.9436 1.0317 93.5472 10.1281 11.1709 0.0165 1.9484 0.0001 34.3192 0.2741 16.0713 8.2520 2.8460 39.0112 5.1428 7.9662 0.2175 2.4049 13.1677 4.8078 0.0512 7.8119 6.0358 13.5582 30.4185 13.0628 59.7167 6.5692 10.0995 3.9079 22.1552 13.9412 6.0363 2.7902 15.2282 40.4769 28.3258 7.8670 15.0281 40.6736 21.3757 18.8330 0.0429 4.5585 17.3727 25.6877
temp: 298.150 k
press: 1.00000 atm
elementType: 16 16 6 6 6 6 6 6 6 6 6 6 1 1 1 1 1 1 1 1 1 1 1 1
symmnumber: 1
zpe: 499585.5 jmol-1
zpe.correction: 0.190282 hartree
zpe.thermalcorrener: 0.202353 hartree
zpe.thermalcorrenthalpy: 0.203297 hartree
zpe.thermalcorrgfe: 0.152508 hartree
zpe.sumelectzpe: -1183.501076 hartree
zpe.sumelectthermal: -1183.489005 hartree
zpe.sumelectthermalent: -1183.488061 hartree
zpe.sumelectthermalfe: -1183.538850 hartree
dipole: -0.3950 0.0016 0.9619
dipole: 1.0399
quadrupole: -73.9090 -85.2359 -89.9397
quadrupole: -0.0092 -1.9520 -0.0068
quadrupole: 9.1192 -2.2077 -6.9115 -0.0092 -1.9520 -0.0068
hfenergy: -1183.6913578 hartree
pointgroup: C01 [X(C10H12S2)]
dipole: 0.1985097 -0.0115389 0.3575538 debye
dipolederiv: -0.6167204 0.0235175 -0.0338284 0.0741539 -0.1836874 -0.051544 0.0054196 -0.0143834 -0.1251644 -0.6162695 -0.0201314 -0.0351948 -0.0734023 -0.1875562 0.0477431 0.0001864 0.0105417 -0.1206715 0.6647474 -0.0045011 0.1351602 -0.0063951 0.3496275 0.0023572 0.1791923 0.0021829 0.2747119 0.0162124 0.0001407 0.0148946 0.0038599 0.0501901 0.0012326 -0.0872066 0.0014583 0.0101626 -0.135696 -0.0001002 0.0058504 0.0000487 -0.0120828 0.0046191 0.012376 0.0048047 -0.1581045 0.5115678 -0.291576 -0.0520206 -0.582815 -0.0629196 0.0057562 -0.0536516 0.0233225 -0.0648523 0.5138007 0.292797 -0.0342488 0.5834508 -0.0632024 -0.0055356 -0.0174029 -0.0231458 -0.0666543 0.0200919 -0.0035228 0.0464044 -0.0034557 0.0416058 0.0052791 0.0386789 0.0046894 -0.1049869 -0.1598294 0.085047 0.007291 0.0588382 0.0863665 -0.0038956 -0.0069985 0.0001523 -0.1243682 -0.160233 -0.0846787 0.0021217 -0.057588 0.0856341 0.0172394 -0.0105266 0.0130733 -0.1233452 0.0014685 0.0242162 -0.0208765 0.0128113 0.0074459 0.0036198 -0.0168883 0.0026962 -0.1645339 0.0013822 -0.0228606 -0.0224492 -0.0117056 0.007227 0.0073455 -0.0177214 0.0082935 -0.1642058 -0.0070034 0.0652833 -0.0269784 0.1290097 -0.0429888 0.0806943 -0.0037498 0.0719391 0.0132426 -0.0088184 -0.0637531 -0.0322525 -0.1290806 -0.03083 -0.0836372 -0.0138982 -0.0748859 0.0021649 0.0286717 0.093208 -0.0588783 0.1324554 -0.0470075 0.0653312 -0.0521198 0.0226954 0.0448502 0.0274729 -0.089814 -0.064926 -0.1294096 -0.0402778 -0.070473 -0.0603409 -0.0279402 0.0389361 -0.0436833 -0.0033741 0.1168969 -0.0023639 0.0857238 0.0008327 0.0830715 0.0010519 0.049384 0.0787935 -0.0919373 -0.0771343 -0.0714263 -0.0402276 -0.0761995 -0.0659335 -0.0179262 0.059716 0.08274 0.0955986 -0.0677927 0.0737253 -0.0509683 0.0701917 -0.0585012 0.0112562 0.0644546 -0.192543 -0.0015001 0.1361904 0.0009248 0.1148917 0.0015043 0.098067 0.0024981 0.0209386 0.0891659 0.0315733 0.0102854 -0.0157041 -0.0702742 -0.0008058 -0.0010219 -0.0083793 0.1570187 0.0891417 -0.0325871 0.0082496 0.0152914 -0.0698906 -0.0136027 0.0000207 -0.0059194 0.1566837 -0.0924752 -0.0867142 0.0188814 -0.0931541 0.036249 0.0050988 0.0215658 0.0052105 0.1628913 -0.0919848 0.0856692 0.0243545 0.0919311 0.0369517 -0.0131516 0.0273829 -0.0132857 0.1617316 unknown
polarizability: 197.2214227|0.1426119|132.5486035|-6.958043|1.4571966|86.2035516 unknown
InChI: InChI=1S/C10H12S2/c1-3-10(2)11-8-6-4-5-7-9(8)12-10/h4-7H,3H2,1-2H3
charge 0 multiplicity 1
24 atoms
S  0.803742 -1.527828 -0.325416
S  0.807587 1.546239 -0.22912
C  1.839582 -0.008627 0.252321
C  3.200929 0.012201 -0.475789
C  1.988567 -0.056973 1.781083
C  -0.808611 -0.705045 -0.084336
C  -0.80675 0.714045 -0.039466
C  3.15658 0.066722 -2.014762
C  -2.022822 -1.417258 0.009632
C  -2.019029 1.42215 0.099686
C  -3.239935 -0.705907 0.134959
C  -3.238049 0.707583 0.179914
H  3.759881 -0.887474 -0.146287
H  3.766268 0.882169 -0.083538
H  2.540681 -0.967543 2.080413
H  2.545041 0.830458 2.136637
H  1.004494 -0.070306 2.278803
H  2.615817 -0.802565 -2.427216
H  2.640954 0.977346 -2.365486
H  4.183011 0.066589 -2.424179
H  -2.021186 -2.511909 -0.013402
H  -2.014443 2.516061 0.145896
H  -4.182887 -1.258269 0.205721
H  -4.179523 1.256842 0.285732
