program: Gaussian 09
title: 000143563
version: EM64L-G09RevD.01
frameworkgroup: C1[X(C11H9F)]
method: RPBEPBE
basis: SDD
operation: Freq
keyword: #pfreq=noraman
keyword: PBEPBE/SDD
title: #p freq=noraman PBEPBE/SDD
converged: NO YES NO NO
title: Mulliken charges:
elementType: F C C C C C C C C C C C H H H H H H H H H
charge: -0.212810 -0.409286 -0.411908 -0.482635 0.399801 0.368497 -0.206634 -0.204499 -0.616264 -0.441934 0.342814 -0.383477 0.258823 0.259594 0.240242 0.241584 0.245085 0.244260 0.270113 0.247104 0.251531
chargesum: 0.00000
title: Mulliken charges with hydrogens summed into heavy atoms:
elementType: F C C C C C C C C C C C
charge: -0.212810 -0.150463 -0.152313 -0.000809 0.399801 0.368497 0.038451 0.039761 -0.346150 -0.194830 0.342814 -0.131946
polarizability: 1.34606225e+02 1.61668783e+00 1.11859089e+02 3.68325830e-01 -1.13300727e+00 6.98727389e+01
1716.lowfreq: -12.2933 -11.9539 -0.0005 -0.0004 0.0004 7.7269 101.8592 167.9480 266.3824
frequency: 101.8442 167.9435 266.3809 279.3267 369.6309 400.5755 417.3374 467.3244 496.6357 530.5584 580.1103 602.2823 697.3844 708.5392 737.8046 747.4961 806.5471 823.4063 836.6923 868.7811 879.3708 887.2770 909.5074 918.9555 937.5098 941.8615 958.4717 1014.4853 1050.4494 1075.1744 1109.3960 1114.2390 1135.0855 1152.1643 1197.6164 1211.0213 1222.1949 1224.6470 1254.0392 1272.5414 1297.3085 1396.2236 1424.4845 1454.6097 1471.7946 1576.7836 1609.2906 1617.2308 3017.2899 3096.8813 3097.5881 3102.9510 3137.9837 3160.1514 3166.4889 3173.2589 3199.3175
redmass: 5.7487 3.9037 6.2403 5.3156 4.2009 4.0710 3.3108 3.5730 3.0732 2.6005 4.0133 3.7202 3.8386 3.0607 2.7638 5.1094 2.3474 2.1055 2.4816 1.8552 2.1762 1.9180 1.8565 2.8516 1.9607 1.9573 1.8702 1.4250 2.2139 1.2240 1.2270 1.4061 1.4413 2.1057 2.3369 2.3688 1.5763 1.4824 1.3536 1.3793 1.5454 5.3632 4.7547 2.6244 1.1518 5.8352 7.8205 7.8454 1.0587 1.0899 1.1065 1.0932 1.0902 1.0932 1.0873 1.0953 1.1104
irintensity: 0.1346 1.3955 0.8115 0.4615 3.8291 1.1743 2.3303 2.6342 1.5562 7.4433 8.4648 4.6137 28.6376 27.5098 33.2303 2.0302 18.6560 40.6777 8.2464 21.4705 4.4444 14.9706 6.8713 13.0737 0.3294 2.3207 0.4636 8.6172 0.3826 0.7147 11.8739 9.4851 0.8737 11.7456 6.0793 28.5488 7.6877 8.2815 1.4746 1.8428 18.8071 2.7655 10.1079 80.6589 18.9678 2.1237 25.3757 17.0687 41.9938 43.2218 36.0754 16.6175 10.6362 2.1877 4.3656 6.1427 17.9805
temp: 298.150 k
press: 1.00000 atm
elementType: 9 6 6 6 6 6 6 6 6 6 6 6 1 1 1 1 1 1 1 1 1
symmnumber: 1
zpe: 432882.2 jmol-1
zpe.correction: 0.164876 hartree
zpe.thermalcorrener: 0.173279 hartree
zpe.thermalcorrenthalpy: 0.174223 hartree
zpe.thermalcorrgfe: 0.131547 hartree
zpe.sumelectzpe: -523.533529 hartree
zpe.sumelectthermal: -523.525126 hartree
zpe.sumelectthermalent: -523.524182 hartree
zpe.sumelectthermalfe: -523.566858 hartree
dipole: -2.6211 0.6568 0.2228
dipole: 2.7113
quadrupole: -75.5339 -61.0738 -69.6106
quadrupole: 2.8097 0.3993 -0.4919
quadrupole: -6.7945 7.6656 -0.8711 2.8097 0.3993 -0.4919
hfenergy: -523.698405 hartree
pointgroup: C01 [X(C11H9F1)]
dipole: 1.0261367 0.2703192 -0.10866 debye
dipolederiv: -1.0805934 -0.2927717 0.0704403 -0.3386302 -0.3275587 0.0220226 0.0858083 0.0216778 -0.1617622 -0.0352513 -0.039664 -0.0349691 -0.0471252 0.2097386 0.081387 -0.0679959 0.0928732 -0.0110566 0.024018 0.1015658 -0.0473643 0.107303 0.1797569 -0.0526079 -0.0720105 -0.0557686 -0.0107083 0.1027494 -0.0297419 0.0298585 -0.0275568 -0.1060297 -0.0162821 0.0198434 -0.0137888 0.1580409 0.2273539 -0.0112771 -0.0261134 -0.3302106 0.0364836 -0.0137366 0.0037085 -0.0621484 -0.079414 0.1935554 -0.0011184 -0.0106713 0.2967332 -0.238188 0.0135058 0.0591774 0.0367387 -0.0893019 -0.2154864 0.1073615 0.1571567 0.151918 -0.0651699 0.0251364 0.1766043 -0.0860265 0.0310008 -0.2719998 -0.054786 0.1371318 -0.0983427 -0.0091158 -0.0713264 0.179056 0.0347802 0.0317309 -0.2793546 -0.0300244 0.0046253 0.1303389 0.0111092 0.0046989 -0.0000883 0.0132376 -0.1599803 0.0601827 -0.0359131 -0.0267989 -0.0041519 0.159857 0.0075111 -0.0490458 0.0268858 -0.1496739 1.1181572 0.2865033 -0.091809 0.3753135 0.3926662 -0.0110834 -0.0885927 -0.0077959 0.0965923 -0.1889709 0.0008914 -0.0127666 -0.2131389 -0.1426505 0.018547 -0.0033484 -0.0061687 -0.1682169 0.0380335 -0.0166237 -0.0046586 0.0223244 -0.1340608 -0.0607346 0.0110928 -0.0649837 0.0483364 0.0213846 -0.0317863 0.0096474 -0.0727433 -0.1281728 0.0460988 0.0226848 0.0461639 0.0571963 0.0513106 0.0099539 -0.1253322 0.0077615 0.0841092 0.0266008 -0.0841445 0.0214188 -0.1395219 -0.1902329 0.0356433 0.0879951 0.0374088 0.0729151 -0.0117074 0.0341478 -0.0046383 0.0669156 0.1441148 -0.0011077 -0.0692617 0.0191511 0.0292866 0.0900058 -0.1170528 0.097793 -0.0016449 0.1345265 -0.020151 -0.0916629 -0.0392083 0.052557 -0.063874 -0.1437179 -0.0588874 -0.0152651 0.0920719 -0.0071376 0.0108072 -0.0391531 -0.0389792 -0.0087458 0.0027588 -0.0110948 0.1685156 0.0793525 -0.0425219 0.0082923 -0.0107441 -0.0932436 -0.0101794 0.003891 -0.0066208 0.146647 -0.0249214 0.0727057 0.0254534 0.0727526 0.0546895 -0.0152366 0.0272237 -0.0136472 0.1815702 unknown
polarizability: 134.6199378|-1.3388781|111.800956|-1.1458486|1.5741211|69.9171596 unknown
InChI: InChI=1S/C11H9F/c12-9-3-4-10-7-1-2-8(5-7)11(10)6-9/h1-4,6-8H,5H2
charge 0 multiplicity 1
21 atoms
F  -3.608462 -0.789303 0.20545
C  1.442451 -1.231577 -0.37814
C  1.76567 1.035272 -0.288333
C  2.087533 -0.12854 -1.302606
C  0.04283 -0.600177 -0.206699
C  0.242226 0.810951 -0.151106
C  2.215137 -0.924092 0.933184
C  2.409095 0.423643 0.985438
C  -1.233655 -1.162688 -0.086425
C  -0.838992 1.684229 0.026008
C  -2.305907 -0.255266 0.086277
C  -2.148495 1.13796 0.145213
H  1.465447 -2.273999 -0.725322
H  2.083981 2.052808 -0.554905
H  1.572992 -0.015754 -2.27353
H  3.171241 -0.278838 -1.446069
H  2.468425 -1.670042 1.690125
H  2.854789 1.006924 1.794711
H  -1.422004 -2.239857 -0.125588
H  -0.697647 2.769697 0.067823
H  -3.027355 1.775549 0.279194
