program: Gaussian 09
title: 000143548
version: EM64L-G09RevD.01
frameworkgroup: C1[X(C13H16O)]
method: RPBEPBE
basis: SDD
operation: Freq
keyword: #pfreq=noraman
keyword: PBEPBE/SDD
title: #p freq=noraman PBEPBE/SDD
converged: YES YES NO NO
title: Mulliken charges:
elementType: O C C C C C C C C C C C C C H H H H H H H H H H H H H H H H
charge: -0.176942 0.354991 -0.219207 -0.542208 -0.546684 -0.534479 0.577640 0.576238 0.112330 -0.609009 -0.610931 -0.530252 -0.768999 -0.788015 0.221827 0.226665 0.218023 0.230463 0.222645 0.231950 0.239998 0.217960 0.239742 0.220476 0.258588 0.241658 0.237132 0.224742 0.245607 0.228052
chargesum: 0.00000
title: Mulliken charges with hydrogens summed into heavy atoms:
elementType: O C C C C C C C C C C C C C
charge: -0.176942 0.354991 -0.219207 -0.093717 -0.098199 -0.079884 0.577640 0.576238 0.112330 -0.151051 -0.150713 -0.030006 -0.307125 -0.314356
polarizability: 1.47390555e+02 -2.05051415e+00 1.26263971e+02 4.11379760e+00 -7.20206652e-01 1.18591848e+02
1716.lowfreq: -5.6464 -0.0005 -0.0004 0.0003 12.7902 17.7487 42.8110 113.8584 129.9575
frequency: 42.4896 113.8454 129.9529 151.2498 167.9366 203.8518 261.8655 302.3539 309.4573 355.8793 386.5210 420.2862 480.8310 491.2661 518.6969 536.4535 543.7753 580.4488 614.9205 635.4293 653.1917 677.0830 703.4673 760.1383 812.0818 826.3764 892.9005 894.0990 914.9818 921.4526 935.4476 937.9578 948.4845 962.9998 969.3707 999.2703 1006.5892 1010.5487 1021.7051 1081.5303 1089.6101 1093.0188 1111.1739 1132.5400 1169.6178 1183.8792 1205.8940 1210.4219 1233.2559 1248.1998 1254.2266 1271.0448 1282.8092 1286.0013 1309.0469 1312.1568 1312.8960 1415.6105 1427.8984 1432.1802 1455.2278 1458.6778 1474.1113 1475.3026 1476.2411 1648.1735 1666.0067 1682.9049 2965.2157 2970.6832 2985.0460 2987.2457 2989.5325 2994.0110 3048.6908 3050.9769 3056.1601 3060.6022 3062.6019 3078.9243 3092.0898 3095.6882 3197.0416 3200.9212
redmass: 3.5532 3.7432 2.9278 3.4189 2.7633 2.5400 2.6881 2.2507 2.2802 2.4622 3.9103 2.7167 3.0610 2.9396 2.9569 2.6486 2.7532 3.7188 3.8792 3.4704 3.8077 1.1231 1.1421 1.5772 1.8689 1.7879 2.1965 2.3101 1.6264 1.9904 1.7165 1.6580 1.8043 2.4810 2.5175 2.3475 1.9000 1.9119 1.8503 1.8049 1.7636 2.3344 2.0693 1.8796 1.6530 1.6417 1.8800 2.2195 2.1942 2.1707 1.7480 1.4676 1.3575 1.3418 1.4977 1.5674 1.5395 1.1695 1.1687 1.0815 1.0871 1.0887 1.0898 1.0908 1.0850 9.5507 6.0707 6.9873 1.0673 1.0664 1.0658 1.0615 1.0611 1.0627 1.0991 1.0989 1.1001 1.0989 1.0995 1.0967 1.0623 1.0629 1.1141 1.1133
irintensity: 1.3145 2.4312 1.8009 0.3461 0.8749 0.7112 0.6058 0.4532 0.4195 0.1738 0.6754 1.9792 3.1666 1.1325 2.4761 2.6617 8.9867 3.4825 4.3626 6.0012 5.8519 1.9910 5.6337 1.1031 3.4075 1.3415 0.6448 1.3461 24.9533 33.3190 35.5467 28.8199 3.4869 7.6763 7.4900 2.4803 11.9388 1.4961 1.4098 3.2001 3.8259 1.1824 65.0894 48.1828 13.4195 1.1141 3.1301 0.5408 18.3895 16.9717 5.7543 5.6397 0.4009 0.2385 2.0889 2.7585 3.1090 1.7218 21.4731 18.2618 7.2496 10.1006 11.6258 12.7733 15.1020 87.3320 19.3779 77.4415 22.6733 20.8928 8.3185 30.5807 36.1361 42.3356 47.1105 33.1779 32.7991 17.7649 40.6515 18.0434 5.9975 7.2338 14.5212 6.9724
temp: 298.150 k
press: 1.00000 atm
elementType: 8 6 6 6 6 6 6 6 6 6 6 6 6 6 1 1 1 1 1 1 1 1 1 1 1 1 1 1 1 1
symmnumber: 1
zpe: 665905.7 jmol-1
zpe.correction: 0.253630 hartree
zpe.thermalcorrener: 0.265848 hartree
zpe.thermalcorrenthalpy: 0.266793 hartree
zpe.thermalcorrgfe: 0.216005 hartree
zpe.sumelectzpe: -579.130899 hartree
zpe.sumelectthermal: -579.118680 hartree
zpe.sumelectthermalent: -579.117736 hartree
zpe.sumelectthermalfe: -579.168524 hartree
dipole: 3.5147 -0.5811 -1.2765
dipole: 3.7842
quadrupole: -86.6810 -79.7904 -85.5994
quadrupole: 0.8109 5.8510 -0.0956
quadrupole: -2.6574 4.2332 -1.5758 0.8109 5.8510 -0.0956
hfenergy: -579.3845289 hartree
pointgroup: C01 [X(C13H16O1)]
dipole: -1.3861073 0.2585375 -0.4779388 debye
polarizability: 147.687305|0.1215164|125.4939839|-3.7597447|2.0988444|119.0650849 unknown
InChI: InChI=1S/C13H16O/c1-9-3-6-12-7-4-10(2)13(9,12)11(14)5-8-12/h1-8H2
charge 0 multiplicity 1
30 atoms
O  1.782688 -0.316756 1.952295
C  -1.294134 0.113656 -0.071621
C  0.271114 -0.074207 -0.021373
C  -1.800528 -0.966115 -1.071309
C  -1.513963 1.571891 -0.572032
C  -1.797281 -0.131137 1.388339
C  0.556256 -1.424008 -0.71029
C  0.869764 1.168818 -0.710344
C  0.643854 -0.086623 1.488906
C  -0.779563 -2.127129 -0.943336
C  -0.265654 1.876553 -1.443897
C  -0.611556 0.243203 2.308201
C  1.780884 -1.886142 -1.053203
C  2.154999 1.585273 -0.612667
H  -1.780025 -0.566599 -2.103727
H  -2.839002 -1.277562 -0.853727
H  -1.546247 2.272583 0.28542
H  -2.464325 1.679951 -1.126023
H  -2.050299 -1.199439 1.529252
H  -2.708473 0.453784 1.607047
H  -0.756932 -2.791151 -1.82491
H  -1.033483 -2.758941 -0.066624
H  -0.075483 2.955239 -1.580094
H  -0.395808 1.433182 -2.452723
H  -0.594518 -0.272341 3.283064
H  -0.592122 1.333058 2.515663
H  2.688938 -1.309775 -0.850264
H  1.906014 -2.857995 -1.545236
H  2.888773 1.041823 -0.007519
H  2.498411 2.491406 -1.125567
