program: Gaussian 09
title: 000143538
version: EM64L-G09RevD.01
frameworkgroup: C1[X(C4H4)]
method: RPBEPBE
basis: SDD
operation: Freq
keyword: #p
keyword: freq=noraman
keyword: PBEPBE/SDD
title: #p freq=noraman PBEPBE/SDD
converged: NO NO NO NO
title: Mulliken charges:
elementType: C C C C H H H H
charge: 0.065855 0.065784 -0.538741 -0.538740 0.255918 0.217003 0.217003 0.255917
chargesum: 0.00000
title: Mulliken charges with hydrogens summed into heavy atoms:
elementType: C C C C
charge: 0.065855 0.065784 -0.065820 -0.065820
polarizability: 4.67305368e+01 3.52571373e-05 3.70704317e+01 7.53022386e-06 3.55251500e-03 3.05648493e+01
1716.lowfreq: -0.0011 -0.0007 -0.0002 28.3879 32.1873 35.2297 364.6581 364.8411 664.2467
frequency: 364.6562 364.8410 664.2466 847.6115 915.3824 1016.4423 1066.1371 1088.9282 1100.0083 1109.8537 1252.3877 1277.9118 1475.6128 1503.0128 3025.1022 3026.4263 3182.9659 3186.0151
redmass: 7.6529 2.2289 2.1009 6.1852 1.1888 1.2374 1.1756 1.4233 1.5058 1.4385 6.4179 5.3535 1.1063 1.1886 1.0659 1.0638 1.1041 1.1066
irintensity: 122.4015 5.7231 0.0000 9.8696 0.0116 0.1764 40.2140 0.0000 0.5665 0.0000 12.5526 1.8349 0.0115 0.1557 62.7661 65.9422 2.6739 9.9908
temp: 298.150 k
press: 1.00000 atm
elementType: 6 6 6 6 1 1 1 1
symmnumber: 1
zpe: 158311.1 jmol-1
zpe.correction: 0.060297 hartree
zpe.thermalcorrener: 0.064239 hartree
zpe.thermalcorrenthalpy: 0.065183 hartree
zpe.thermalcorrgfe: 0.034871 hartree
zpe.sumelectzpe: -154.314043 hartree
zpe.sumelectthermal: -154.310101 hartree
zpe.sumelectthermalent: -154.309157 hartree
zpe.sumelectthermalfe: -154.339470 hartree
dipole: 0.0000 -0.0011 1.0145
dipole: 1.0145
quadrupole: -19.3359 -29.7429 -23.2071
quadrupole: 0.0000 0.0000 -0.0042
quadrupole: 4.7594 -5.6476 0.8882 0.0000 0.0000 -0.0042
hfenergy: -154.3743408 hartree
pointgroup: C01 [X(C4H4)]
dipole: 0.0000023 0.0002715 0.3991522 debye
dipolederiv: -0.2191946 -0.0000147 0. -0.0000165 -0.5967695 0.0046025 0.0000148 0.3434493 -0.1782083 -0.2193158 -0.0000189 0.0000005 -0.0000171 -0.5968783 -0.0044577 -0.000014 -0.3432552 -0.1781324 0.2975396 0.0000401 0.227627 0.0000671 0.3258849 0.0000238 0.0800942 0.0000001 0.3199141 0.297537 -0.0000364 -0.227627 -0.0000596 0.3258849 0.0000439 -0.0800939 0.000007 0.3199182 -0.0502573 0.0000138 0.0340985 0.0000069 0.1455722 -0.0000263 0.0659266 -0.0000314 0.0240166 -0.028026 -0.000015 -0.0579499 -0.0000351 0.125367 -0.0000792 -0.1453485 -0.0000661 -0.1657615 -0.0280239 0.000028 0.057949 0.0000462 0.1253668 -0.0000833 0.1453468 -0.0000786 -0.1657641 -0.050259 0.0000031 -0.0340982 0.0000082 0.145572 -0.0000238 -0.0659259 -0.0000251 0.0240174 unknown
polarizability: 46.7305368|-0.0003814|37.0704336|-0.0001062|-0.0006253|30.5648475 unknown
InChI: InChI=1S/C4H4/c1-3-2-4(1)3/h1-2H2
charge 0 multiplicity 1
8 atoms
C  0.000043 0.717743 -0.198728
C  -0.000023 -0.717897 -0.198435
C  1.255009 0.000063 0.336059
C  -1.254983 0.000174 0.336074
H  2.100145 -0.00014 -0.35767
H  1.531271 0.000292 1.404714
H  -1.531235 0.000425 1.404732
H  -2.100128 0.000039 -0.357645
