program: Gaussian 09
title: 000143520
version: EM64L-G09RevD.01
frameworkgroup: C1[X(C14H14S2Si)]
method: RPBEPBE
basis: SDD
operation: Freq
keyword: #p
keyword: freq=noraman
keyword: PBEPBE/SDD
title: #p freq=noraman PBEPBE/SDD
converged: YES YES NO NO
title: Mulliken charges:
elementType: S S Si C C C C C C C C C C C C C C H H H H H H H H H H H H H H
charge: -0.081537 -0.081239 0.682385 -0.109971 -0.109562 -0.600940 -0.601490 -0.294289 -0.293798 -0.308168 -0.307623 -0.226713 -0.226730 -0.236439 -0.236600 -0.229957 -0.230099 0.280419 0.267145 0.280381 0.267306 0.256207 0.256646 0.249957 0.249495 0.230125 0.230071 0.231225 0.231193 0.231313 0.231285
chargesum: 0.00000
title: Mulliken charges with hydrogens summed into heavy atoms:
elementType: S S Si C C C C C C C C C C C C C C
charge: -0.081537 -0.081239 0.682385 -0.109971 -0.109562 -0.053375 -0.053803 -0.038081 -0.037152 -0.058211 -0.058128 0.003412 0.003341 -0.005214 -0.005407 0.001356 0.001186
polarizability: 2.35263936e+02 2.60313032e-01 2.38443009e+02 -1.95054514e+01 9.02982972e-02 1.44683289e+02
1716.lowfreq: -19.1704 -12.0986 -9.8619 -0.0026 -0.0019 0.0014 7.2852 37.6098 40.7740
frequency: -16.8401 37.2630 40.5294 52.9571 70.8152 82.0812 126.2337 181.0045 195.4997 202.5315 235.5381 245.7773 250.3106 321.7203 389.5294 392.7242 395.5447 421.5842 448.7260 465.1872 496.1392 504.0685 600.8279 614.0940 614.7952 620.9339 680.6866 700.8354 701.3429 703.8579 748.9542 750.2489 850.8644 860.2401 865.0478 930.9499 931.9447 935.8214 983.6756 985.9862 986.1917 986.6130 1002.7079 1002.9384 1018.9337 1022.0650 1023.5175 1074.8502 1078.1222 1092.0098 1101.1051 1110.3682 1157.3124 1174.6507 1174.6901 1195.4488 1197.4327 1260.2776 1285.6362 1307.1771 1311.7677 1367.4793 1369.2987 1418.9325 1421.3616 1425.1080 1430.4517 1467.6159 1468.8037 1576.4673 1577.9621 1595.5800 1595.8962 3020.6090 3029.7023 3096.1856 3113.4535 3117.5488 3118.8037 3121.2976 3121.8774 3133.0917 3133.6909 3145.2937 3145.5721 3161.5645 3161.9857
redmass: 3.7841 4.1543 3.7033 5.2211 6.0621 8.3489 8.0318 4.7326 5.3009 7.0128 2.2173 6.5940 4.9113 17.2772 3.0746 3.8489 2.8132 5.1033 4.4819 7.3904 5.4994 8.0548 5.9692 6.4730 6.4673 3.8435 6.7720 6.8437 1.9720 2.0473 1.6188 1.5735 1.6298 1.2473 1.2426 1.3502 1.4625 1.3719 1.3998 5.9631 1.5174 4.6369 1.3185 1.3168 2.5895 3.1635 2.9238 1.7098 1.6856 2.6374 2.8120 1.0401 1.2868 1.0564 1.0562 1.1266 1.1273 1.2255 1.1812 1.4197 1.3898 5.1702 5.7412 2.1409 2.1435 1.0842 1.0988 2.0134 2.0202 5.5200 5.6179 5.8126 5.7971 1.0560 1.0593 1.1072 1.1074 1.0863 1.0855 1.0873 1.0877 1.0914 1.0916 1.0959 1.0960 1.1016 1.1016
irintensity: 0.2703 0.1221 1.5217 0.1058 0.7128 0.0111 6.2811 0.5199 6.0073 0.7108 3.2377 0.4340 0.0752 0.3344 0.4283 1.7886 0.0378 10.7365 9.8414 62.7685 58.3376 105.2496 6.0629 0.2112 0.8465 4.7086 13.5961 18.3424 74.1512 18.6947 62.4525 15.4927 11.7712 0.3657 0.0201 0.3649 7.8078 2.5918 0.2740 2.3495 0.1885 1.0162 0.0437 0.1201 3.6815 0.8468 2.9821 9.1244 0.0197 26.0693 66.6444 0.5421 0.0001 0.1425 0.4024 11.2508 2.9837 2.8473 21.1485 8.4963 4.3195 0.1025 1.4986 20.8418 17.9100 15.6047 4.8730 4.5622 10.0401 0.0810 0.9280 0.1441 0.3643 11.7525 39.9065 0.0374 13.5520 5.3132 0.0258 1.4369 0.0048 5.0974 0.6639 41.2327 25.5256 54.7487 25.1682
temp: 298.150 k
press: 1.00000 atm
elementType: 16 16 14 6 6 6 6 6 6 6 6 6 6 6 6 6 6 1 1 1 1 1 1 1 1 1 1 1 1 1 1
symmnumber: 1
zpe: 625266.1 jmol-1
zpe.correction: 0.238151 hartree
zpe.thermalcorrener: 0.253830 hartree
zpe.thermalcorrenthalpy: 0.254774 hartree
zpe.thermalcorrgfe: 0.193582 hartree
zpe.sumelectzpe: -1626.248275 hartree
zpe.sumelectthermal: -1626.232596 hartree
zpe.sumelectthermalent: -1626.231652 hartree
zpe.sumelectthermalfe: -1626.292844 hartree
dipole: 0.0161 -0.4672 0.0144
dipole: 0.4677
quadrupole: -108.2122 -103.3675 -132.3208
quadrupole: 0.1517 -2.7621 0.0467
quadrupole: 6.4213 11.2660 -17.6873 0.1517 -2.7621 0.0467
hfenergy: -1626.486426 hartree
pointgroup: C01 [X(C14H14S2Si1)]
dipole: -0.0154831 0.1833107 0.0043573 debye
polarizability: 226.5003193|-0.2366253|238.445866|33.0965229|1.3685597|153.4440488 unknown
InChI: InChI=1S/C14H14S2Si/c1-3-7-13(8-4-1)17(15-11-12-16-17)14-9-5-2-6-10-14/h1-10H,11-12H2
charge 0 multiplicity 1
31 atoms
S  0.151523 -2.266001 -1.724362
S  0.01887 -2.265413 1.72265
Si 0.032519 -0.77269 -0.002243
C  1.550286 0.351083 0.203647
C  -1.564751 0.23551 -0.208213
C  0.548049 -3.778494 -0.634941
C  -0.303064 -3.798114 0.636728
C  2.648691 -0.033586 1.019053
C  -2.626618 -0.224582 -1.032746
C  1.620654 1.587269 -0.498246
C  -1.734015 1.455604 0.505395
C  3.786469 0.796872 1.133635
C  -3.825067 0.516044 -1.14452
C  2.7608 2.414421 -0.388728
C  -2.934712 2.192446 0.399046
C  3.846019 2.021411 0.428787
C  -3.982882 1.724669 -0.42749
H  1.623828 -3.76107 -0.39781
H  0.320941 -4.650205 -1.273758
H  -1.37838 -3.833905 0.39907
H  -0.034187 -4.65647 1.277389
H  2.606658 -0.981766 1.568452
H  -2.508974 -1.161067 -1.591067
H  0.786963 1.906228 -1.136028
H  -0.93057 1.831715 1.150877
H  4.623362 0.488644 1.770591
H  -4.632867 0.150423 -1.788624
H  2.801454 3.361357 -0.938754
H  -3.051126 3.127325 0.958813
H  4.729668 2.663972 0.515822
H  -4.91364 2.29727 -0.511824
