program: Gaussian 09
title: 000143499
version: EM64L-G09RevD.01
frameworkgroup: C1[X(C5H9N3O)]
method: RPBEPBE
basis: SDD
operation: Freq
keyword: #pfreq=noraman
keyword: PBEPBE/SDD
title: #p freq=noraman PBEPBE/SDD
converged: NO YES NO NO
title: Mulliken charges:
elementType: O N N N C C C C C H H H H H H H H H
charge: -0.278540 -0.216376 -0.184948 -0.053540 0.246562 0.223175 -0.616126 -0.729965 -0.600478 0.274879 0.234323 0.233171 0.233207 0.231959 0.261885 0.240914 0.240895 0.259002
chargesum: 0.00000
title: Mulliken charges with hydrogens summed into heavy atoms:
elementType: O N N N C C C C C
charge: -0.278540 -0.216376 -0.184948 -0.053540 0.246562 0.223175 0.126247 -0.002915 0.140335
polarizability: 9.55520922e+01 1.98607892e-01 8.31687284e+01 1.09341888e-02 5.52493763e-02 4.75854376e+01
1716.lowfreq: -12.3427 -11.9856 -6.5598 -0.0007 -0.0005 -0.0003 101.0643 112.1716 135.6432
frequency: 101.0515 112.1697 135.6422 144.4863 159.4949 241.3901 250.8411 259.2409 303.6864 339.5732 569.9203 584.7102 601.4147 628.6733 701.4989 751.7940 880.4769 964.6071 1016.5426 1020.8661 1046.6436 1128.4367 1132.0904 1180.0705 1219.4976 1281.5792 1369.9716 1391.0121 1408.5691 1433.7386 1449.1810 1461.7756 1469.0979 1470.7351 1483.7506 1485.9191 1488.6049 1546.3087 1673.8647 2983.4086 2986.2589 2995.4635 3059.4036 3075.4218 3083.6452 3098.2440 3115.9351 3117.1495
redmass: 1.1881 1.0933 2.0773 1.0970 2.7490 2.4927 4.7140 2.6827 4.6933 5.5476 4.0689 4.8590 4.4517 6.3659 10.2462 7.4491 3.6460 2.2615 4.1414 1.7894 1.4607 1.3047 1.3019 2.3673 2.5521 5.2619 6.4022 1.4891 1.5634 1.2097 1.2369 1.0477 1.0426 1.5697 1.0725 1.1578 1.0816 4.6711 10.1942 1.0380 1.0336 1.0333 1.0982 1.1027 1.1026 1.1003 1.1005 1.0971
irintensity: 0.9160 0.6966 13.6959 0.2689 1.0485 4.0078 0.1822 5.4293 6.0877 1.8787 12.2281 9.9425 3.5804 0.0021 9.6372 13.5557 9.6231 11.4405 15.6041 4.7433 4.2093 0.2105 0.5912 6.2680 23.6675 14.2614 62.3487 20.3614 11.0902 31.0686 91.3105 12.1096 16.3078 12.4155 27.8958 24.3587 19.7536 37.8690 387.1048 11.2958 72.3509 46.2967 15.7275 27.6974 27.4299 1.8047 4.4070 7.0662
temp: 298.150 k
press: 1.00000 atm
elementType: 8 7 7 7 6 6 6 6 6 1 1 1 1 1 1 1 1 1
symmnumber: 1
zpe: 379239.3 jmol-1
zpe.correction: 0.144445 hartree
zpe.thermalcorrener: 0.154136 hartree
zpe.thermalcorrenthalpy: 0.155080 hartree
zpe.thermalcorrgfe: 0.109848 hartree
zpe.sumelectzpe: -434.719399 hartree
zpe.sumelectthermal: -434.709707 hartree
zpe.sumelectthermalent: -434.708763 hartree
zpe.sumelectthermalfe: -434.753995 hartree
dipole: -3.1426 -1.1901 0.0012
dipole: 3.3604
quadrupole: -43.7167 -60.8165 -53.4514
quadrupole: -7.0690 0.0151 0.0132
quadrupole: 8.9448 -8.1550 -0.7898 -7.0690 0.0151 0.0132
hfenergy: -434.8638433 hartree
pointgroup: C01 [X(C5H9N3O1)]
dipole: 1.236364 -0.4682747 -0.001292 debye
dipolederiv: -0.7098401 0.3778982 0.0015531 0.4240506 -1.1586799 -0.0021721 0.0009184 -0.0018138 -0.3851593 -0.8609347 0.2549301 0.0023178 -0.2062318 -0.7638124 0.0006506 -0.0042775 -0.0028681 -0.1593685 -0.535584 -0.3446019 -0.0014719 0.3096377 -0.6443303 0.0004098 0.0008941 -0.0011619 -0.1732526 -0.1085213 -0.137444 0.0001799 -0.4760267 -0.442852 -0.0012325 -0.0011032 -0.0002847 -0.1930725 0.2618071 -0.1364204 0.0006365 0.0922482 0.7779996 0.0010163 0.008076 0.0003695 0.0346427 1.0262775 -0.3897614 -0.0024714 -0.4513262 1.5156678 0.0026384 -0.0026102 0.0033034 0.2121121 0.3068247 0.2019552 -0.0014572 0.3018691 0.2669873 -0.0045519 0.0010727 -0.0039011 0.2480104 -0.0793312 0.0678148 0.0004812 0.0131259 -0.0221213 -0.0014405 -0.0058966 -0.0004483 0.0850369 0.5085326 0.2613816 0.000873 0.1691688 0.1408473 -0.0002562 0.0004852 -0.0005528 0.2410186 0.1102822 0.1301703 0.0045941 -0.0057777 0.0048282 -0.003039 0.00227 -0.0029393 0.1336924 -0.0298817 -0.0776666 0.0928145 -0.0308297 0.0768128 -0.0458664 0.1286751 0.0142083 -0.0644508 -0.0364986 -0.0735552 -0.0965648 -0.0220801 0.0789522 0.052454 -0.1285032 -0.0052701 -0.0536733 -0.0249214 0.0090077 -0.0702436 -0.020898 0.0934696 -0.0793578 -0.1193533 -0.044659 -0.040876 -0.0249933 0.0034578 0.070533 -0.0295943 0.0869687 0.0859233 0.1187902 0.0511097 -0.0310749 0.1088748 -0.056826 -0.0016698 0.0307379 -0.0752968 -0.0052537 0.0007072 -0.0051829 0.1296516 0.0185886 -0.0531939 0.0028944 -0.1081669 0.0270464 0.1020535 0.0774721 0.1145648 -0.0587652 0.0187845 -0.0531633 -0.0030056 -0.1076429 0.0281639 -0.1017211 -0.0778901 -0.1141655 -0.0599632 0.0505345 0.016017 0.0000068 0.1177361 0.0093487 -0.0002546 0.000273 -0.0003081 0.1354918 unknown
polarizability: 95.5520797|-0.1990068|83.1688238|0.0114415|0.0094575|47.5853547 unknown
InChI: InChI=1S/C5H9N3O/c1-4-6-8(3)5(9)7(4)2/h1-3H3
charge 0 multiplicity 1
18 atoms
O  -1.297066 1.889999 0.006474
N  0.749516 0.601347 0.002677
N  -1.148101 -0.519333 0.000409
N  -0.118861 -1.491286 -0.002366
C  1.015101 -0.772703 -0.000663
C  -0.665233 0.795887 0.003764
C  1.690884 1.717954 0.002466
C  2.385144 -1.369589 0.000043
C  -2.549908 -0.909597 -0.001398
H  1.09234 2.644358 0.031541
H  2.311008 1.722454 -0.911562
H  2.349325 1.688441 0.888494
H  2.953041 -1.090736 0.907385
H  2.973837 -1.043925 -0.877656
H  2.293795 -2.466602 -0.028726
H  -2.790574 -1.505959 0.895566
H  -2.789508 -1.501412 -0.901663
H  -3.14904 0.015204 0.000617
