program: Gaussian 09
title: 000143482
version: EM64L-G09RevD.01
frameworkgroup: C1[X(C7H10OS)]
method: RPBEPBE
basis: SDD
operation: Freq
keyword: #p
keyword: freq=noraman
keyword: PBEPBE/SDD
title: #p freq=noraman PBEPBE/SDD
converged: YES YES NO NO
title: Mulliken charges:
elementType: S O C C C C C C C H H H H H H H H H H
charge: 0.165243 -0.217620 -0.519106 -0.329343 0.222188 0.003345 -0.347018 -0.683375 -0.742009 0.293015 0.227636 0.244872 0.279072 0.223049 0.212195 0.226378 0.247803 0.248837 0.244838
chargesum: 0.00000
title: Mulliken charges with hydrogens summed into heavy atoms:
elementType: S O C C C C C C C
charge: 0.165243 -0.217620 -0.226091 0.143165 0.222188 0.003345 -0.067945 -0.021753 -0.000532
polarizability: 1.15950414e+02 7.49204274e+00 1.08739239e+02 -4.63309607e+00 2.23859006e+00 5.85124069e+01
1716.lowfreq: -13.9307 -11.4997 0.0013 0.0027 0.0030 11.2805 57.5499 100.8676 105.8382
frequency: 57.4956 100.8416 105.8349 162.0997 178.4765 237.5807 271.3370 297.2676 356.3036 429.6550 467.7570 502.7985 534.3321 616.9396 652.6399 676.7379 805.1709 827.8126 861.6563 926.3147 991.4291 1036.1622 1041.4974 1079.5415 1097.4971 1128.7820 1171.1691 1198.8482 1222.3177 1261.0203 1276.6231 1333.0798 1394.6835 1395.2540 1454.1831 1458.7636 1460.2927 1476.4072 1483.7080 1592.3239 1598.6177 2978.0507 2983.9010 2990.3857 3030.9499 3048.5868 3063.6452 3077.3526 3080.9772 3101.9425 3179.5784
redmass: 4.6554 2.3279 1.1036 3.1923 2.3772 1.2776 3.5871 3.6206 2.9025 9.2074 3.7696 4.2082 6.0606 5.4677 4.1357 2.5935 1.2977 1.8503 2.0104 2.2572 1.5575 1.4649 1.5559 1.8290 2.5308 4.0141 1.2801 1.9108 1.3864 2.5989 1.2154 1.4097 1.2122 1.2277 1.0436 1.0736 1.0805 1.0465 1.0481 7.7793 8.8683 1.0361 1.0368 1.0601 1.0869 1.0977 1.0969 1.1012 1.0991 1.0996 1.0953
irintensity: 3.4280 1.3027 0.3464 2.5026 0.3987 1.2949 2.9759 1.9730 2.3099 6.9337 6.8824 5.5000 1.0128 19.8175 3.8886 3.9022 18.8062 21.5346 14.7983 16.8740 2.1694 2.0587 6.6963 2.6937 3.9826 16.0558 8.7341 26.3148 5.1902 80.2887 5.1970 4.0828 20.7793 24.9563 19.6570 7.6914 19.7633 14.0826 12.3367 334.8226 17.4440 27.1829 10.4628 11.3235 1.2776 2.0513 9.2469 45.9774 41.1194 13.7815 1.0391
temp: 298.150 k
press: 1.00000 atm
elementType: 16 8 6 6 6 6 6 6 6 1 1 1 1 1 1 1 1 1 1
symmnumber: 1
zpe: 399293.3 jmol-1
zpe.correction: 0.152083 hartree
zpe.thermalcorrener: 0.162078 hartree
zpe.thermalcorrenthalpy: 0.163023 hartree
zpe.thermalcorrgfe: 0.116446 hartree
zpe.sumelectzpe: -745.332443 hartree
zpe.sumelectthermal: -745.322447 hartree
zpe.sumelectthermalent: -745.321503 hartree
zpe.sumelectthermalfe: -745.368079 hartree
dipole: -1.6773 -2.7460 0.3820
dipole: 3.2403
quadrupole: -50.7412 -73.0992 -61.5051
quadrupole: -2.5089 -1.3732 0.0755
quadrupole: 11.0406 -11.3174 0.2767 -2.5089 -1.3732 0.0755
hfenergy: -745.4845253 hartree
pointgroup: C01 [X(C7H10O1S1)]
dipole: -0.6182105 1.1082082 -0.1220306 debye
dipolederiv: -0.4309033 -0.2324536 -0.059093 0.0072131 -0.3454531 -0.0578203 -0.0521983 -0.0855456 -0.0855086 -0.5621213 0.3104184 -0.0124802 0.2505252 -1.1411618 -0.0019759 -0.0050586 -0.0258853 -0.3331231 0.0386604 -0.4139949 -0.0435835 -0.4615666 -0.1233945 -0.0440151 -0.0253209 -0.0963563 0.1132968 0.1480159 0.0463458 0.0158941 0.0970425 0.0407548 -0.0384082 -0.0862594 -0.0450441 0.1018542 0.8490182 -0.522997 0.0948338 -0.1192138 1.123151 0.0253987 0.1643627 0.0373204 0.1437882 0.6874471 0.1905567 0.1757819 0.0151366 0.9006508 0.0950289 0.1872671 0.1589223 -0.0636363 -0.63365 0.58762 -0.0141618 0.1799452 -0.6572028 0.0045806 -0.0834209 0.056787 -0.1876274 -0.0147469 -0.0807825 0.0098452 -0.0727292 0.0108711 -0.0202924 0.0528851 -0.0126085 0.0686853 -0.2208928 0.0796411 -0.0388834 0.1110145 -0.052293 0.0137538 -0.0471306 0.0020208 0.0524927 0.04846 0.0253909 -0.0516196 0.0675516 0.0608427 0.0083167 -0.0207449 0.0178572 -0.0336867 0.0237447 -0.011162 -0.0957012 -0.0397947 0.0597855 0.0314594 -0.0468245 0.0049795 -0.1109832 -0.0115987 0.0240846 0.0134587 0.0664354 -0.0645001 -0.0077503 0.0325253 0.005737 0.0926581 0.0130123 -0.0555322 -0.0393249 -0.079922 0.0420394 -0.0338697 -0.0526663 -0.0316364 0.1868524 0.0451838 0.1393358 -0.0060589 0.0754576 -0.0825644 -0.0034546 -0.0251855 -0.0060059 0.0887597 0.0618051 -0.0093469 -0.0596528 0.0118748 0.063057 0.0536459 -0.1179355 0.012327 -0.1393956 -0.1220093 -0.0517366 0.1151148 -0.0273082 0.0895896 -0.0033994 0.1448909 0.0133475 0.0028912 0.0700121 -0.0152323 0.0281862 -0.0006199 0.0146568 0.106324 -0.0208823 0.113788 0.0137152 0.059355 0.0343819 0.0069957 0.0330751 0.0656142 -0.0870732 0.0554534 -0.0947032 -0.024138 -0.0487923 -0.0445372 -0.0395511 -0.1141171 -0.0044434 -0.0404487 -0.0537568 -0.0253015 0.1131049 unknown
polarizability: 115.3470719|-7.8782509|109.1667682|4.6663783|3.4144014|58.6882202 unknown
InChI: InChI=1S/C7H10OS/c1-3-7-6(8)4-5(2)9-7/h4,7H,3H2,1-2H3
charge 0 multiplicity 1
19 atoms
S  -0.308383 1.524508 0.390481
O  0.510481 -2.387724 0.094406
C  0.860226 0.014547 0.458575
C  2.064238 0.16046 -0.495155
C  -0.007039 -1.232017 0.129529
C  -1.717246 0.448635 -0.037256
C  -1.405936 -0.88682 -0.126171
C  3.038708 1.283044 -0.08871
C  -3.055211 1.097696 -0.248122
H  1.205997 -0.057114 1.506218
H  1.693605 0.325889 -1.524346
H  2.581122 -0.819368 -0.491992
H  -2.13598 -1.659743 -0.378702
H  2.545324 2.272399 -0.111383
H  3.430963 1.120702 0.932783
H  3.900164 1.320916 -0.779133
H  -3.007858 1.845886 -1.061322
H  -3.383107 1.630536 0.663822
H  -3.819168 0.346667 -0.507723
