program: Gaussian 09
title: 000143477
version: EM64L-G09RevD.01
frameworkgroup: C1[X(C32H21N)]
method: RPBEPBE
basis: SDD
operation: Freq
keyword: #pfreq=noraman
keyword: PBEPBE/SDD
title: #p freq=noraman PBEPBE/SDD
converged: YES YES NO NO
title: Mulliken charges:
elementType: N C C C C C C C C C C C C C C C C C C C C C C C C C C C C C C C C H H H H H H H H H H H H H H H H H H H H H
charge: -0.159311 -0.221914 -0.222148 0.464884 0.463442 -0.458726 0.200736 0.200499 0.007157 0.521001 -0.469308 -0.469011 0.261373 0.260752 -0.458235 -0.458434 -0.237054 -0.236545 -0.391768 -0.426092 -0.391487 -0.426849 -0.177614 -0.176807 -0.238374 -0.243358 -0.237965 -0.242746 -0.214938 -0.215295 -0.256515 -0.255938 -0.231689 0.263676 0.263505 0.232730 0.232683 0.215742 0.215754 0.246276 0.262343 0.246060 0.262184 0.302839 0.302295 0.223697 0.226594 0.223799 0.226651 0.242525 0.242488 0.227632 0.227666 0.251140
chargesum: 0.00000
title: Mulliken charges with hydrogens summed into heavy atoms:
elementType: N C C C C C C C C C C C C C C C C C C C C C C C C C C C C C C C C
charge: -0.159311 -0.221914 -0.222148 0.464884 0.463442 -0.458726 0.200736 0.200499 0.007157 0.521001 -0.205632 -0.205506 0.261373 0.260752 -0.225506 -0.225750 -0.021312 -0.020791 -0.145493 -0.163749 -0.145427 -0.164664 0.125225 0.125488 -0.014678 -0.016764 -0.014166 -0.016095 0.027587 0.027192 -0.028883 -0.028271 0.019451
polarizability: 6.74846936e+02 -7.73539981e-02 4.93481844e+02 2.11559086e-01 1.72327125e+01 1.84482141e+02
1716.lowfreq: -2.7452 -0.3081 0.0001 0.0003 0.0007 4.5707 27.0005 44.1612 45.5383
frequency: 26.9623 44.1607 45.5219 49.0760 53.3227 60.6748 61.8352 79.7990 97.1195 130.4767 158.8685 174.8608 185.0391 222.2622 227.4364 240.2669 241.8979 253.9748 255.0836 279.7772 314.6705 369.0401 396.0668 405.6837 406.8807 416.3897 436.1763 463.4648 480.8980 481.1008 500.0179 510.2310 534.8685 543.2489 547.2709 587.2156 613.3560 615.5528 625.1336 635.9435 636.5874 646.6753 647.3339 669.8459 681.9747 701.5304 703.4327 711.5987 726.0234 727.9594 744.1768 758.5306 766.8877 777.6260 778.6930 788.3289 799.7519 819.5366 843.7488 855.6755 856.3386 876.2190 894.4145 901.9219 906.2267 915.1790 920.9802 925.3532 955.6971 968.4239 971.6889 974.0454 976.7597 979.3233 980.9524 987.2293 988.1473 992.1333 992.5218 998.8097 1014.1373 1026.1846 1029.4909 1033.5905 1047.9509 1067.9203 1071.0392 1074.9181 1088.3851 1090.9376 1157.6107 1166.3772 1167.0974 1170.0744 1170.7155 1179.1351 1187.1914 1187.5356 1202.7251 1212.8439 1229.2724 1231.3035 1279.1061 1304.1626 1307.8796 1311.5816 1321.4652 1343.3600 1356.9442 1362.1352 1362.5605 1367.6603 1383.3520 1394.6957 1421.7121 1432.6017 1435.6287 1445.0509 1445.6720 1460.9114 1469.7047 1479.2940 1480.2758 1481.5189 1516.1841 1536.4216 1563.8822 1575.4118 1577.4792 1605.4530 1606.8038 1608.1038 1610.6309 1618.1552 1623.2376 3118.2206 3118.3059 3118.5571 3119.0406 3123.8348 3123.9546 3137.4896 3137.6606 3139.4463 3140.3955 3145.2788 3145.3551 3157.0225 3157.9678 3160.9932 3161.7249 3161.8545 3170.2635 3187.0796 3219.4352 3223.8490
redmass: 5.5744 4.4814 5.3579 4.9809 4.8491 4.4376 4.2930 4.6915 3.8615 5.6730 4.9742 4.1229 4.7171 6.5364 4.6966 6.4010 4.3026 4.0558 5.7081 4.8727 6.2866 5.9586 4.8181 2.9705 2.9058 2.9658 4.7385 3.2719 4.1569 3.8246 5.0976 5.2026 5.5292 4.9261 6.6072 6.7502 6.3710 6.2356 4.0797 6.2660 3.5799 6.8342 6.8573 2.1136 6.2097 3.0790 2.2063 2.3420 2.9348 1.9387 4.5151 2.1418 1.7605 1.8473 1.8708 5.2854 3.1858 1.2639 2.7515 1.2548 1.2625 1.3845 5.9121 1.3972 6.7652 1.4826 1.4193 1.4440 1.3731 6.1520 1.3522 1.3035 1.3819 1.4298 1.4264 4.8945 5.5313 1.3446 1.3175 5.0793 3.7402 2.2928 2.1367 2.2837 1.9693 2.1937 1.9077 1.8085 2.2762 2.1514 1.2597 1.5292 1.6179 1.0557 1.1331 1.5915 1.1172 1.1173 1.2946 1.5206 2.3824 2.1188 4.6143 3.6976 1.5209 1.5124 4.8552 1.3412 2.1704 3.5936 3.9527 5.8353 7.3034 3.3836 2.0687 2.3786 2.4398 4.0060 3.8180 2.2510 3.3637 2.9685 3.0205 2.9349 4.1507 7.1359 8.5846 5.8545 6.5327 7.8609 6.1508 6.3856 6.7328 7.4236 5.6471 1.0846 1.0845 1.0855 1.0855 1.0872 1.0872 1.0923 1.0922 1.0936 1.0929 1.0964 1.0963 1.0969 1.0968 1.0872 1.1014 1.1013 1.0915 1.0983 1.0947 1.0987
irintensity: 0.2795 0.2218 1.9813 0.3568 2.1076 0.2846 0.3506 0.0479 0.9266 1.4346 6.4721 2.0902 2.3445 1.2408 0.6427 1.3877 0.0005 0.6632 0.0182 3.1315 1.1229 5.5665 2.0343 0.5725 0.6862 6.6403 1.1711 0.0611 0.7785 0.8794 3.1367 2.6639 15.8690 6.3636 5.5643 8.4674 1.2269 0.0116 4.8962 0.4372 0.4021 2.8743 6.3440 32.0711 14.4460 9.1656 17.2127 15.2161 0.8301 120.0749 7.7399 18.7883 31.9528 60.3503 15.0775 0.0163 21.3910 2.9181 57.5346 2.1890 1.7855 4.6553 13.2634 0.1627 0.8392 0.4071 0.5857 2.5408 0.4102 20.0611 0.1575 0.2535 1.3019 2.0179 1.0501 0.9434 11.6545 1.8877 0.2019 76.9855 0.7122 20.2436 4.7734 0.0432 10.8942 2.7139 1.3315 9.7423 6.4484 13.6320 0.9148 0.2365 11.1236 0.0689 1.6427 1.5841 0.7735 1.1336 150.5873 0.0990 1.2762 2.8053 48.9305 3.9378 10.5204 2.3744 52.2795 0.9660 10.8435 97.6574 2.5822 0.6121 193.1455 0.3192 1.0078 5.2338 22.4449 65.6602 8.2618 91.0280 1.9356 13.8926 6.7081 39.6778 10.9294 4.0775 73.7347 0.2509 15.0273 18.9921 123.3151 59.0011 61.0053 4.8465 159.6162 8.5332 1.8172 10.8216 0.6206 1.2299 0.8720 23.7051 9.8286 23.3537 73.6164 39.9989 6.9389 30.5205 31.0883 4.1233 66.5772 1.9276 7.2149 8.1179 0.7157 0.2493
temp: 298.150 k
press: 1.00000 atm
elementType: 7 6 6 6 6 6 6 6 6 6 6 6 6 6 6 6 6 6 6 6 6 6 6 6 6 6 6 6 6 6 6 6 6 1 1 1 1 1 1 1 1 1 1 1 1 1 1 1 1 1 1 1 1 1
symmnumber: 1
zpe: 1110033.5 jmol-1
zpe.correction: 0.422789 hartree
zpe.thermalcorrener: 0.447326 hartree
zpe.thermalcorrenthalpy: 0.448271 hartree
zpe.thermalcorrgfe: 0.368032 hartree
zpe.sumelectzpe: -1284.566318 hartree
zpe.sumelectthermal: -1284.541781 hartree
zpe.sumelectthermalent: -1284.540836 hartree
zpe.sumelectthermalfe: -1284.621075 hartree
dipole: -6.3370 0.0394 -0.0289
dipole: 6.3372
quadrupole: -157.6803 -171.4832 -191.7125
quadrupole: -0.1069 0.0530 7.2131
quadrupole: 15.9450 2.1421 -18.0871 -0.1069 0.0530 7.2131
hfenergy: -1284.9891071 hartree
pointgroup: C01 [X(C32H21N1)]
dipole: 2.4736968 -0.3115082 -0.0092699 debye
polarizability: 672.2142373|-21.9971155|491.0615461|-5.122115|-42.50413|189.535137 unknown
InChI: InChI=1S/C32H21N/c1-4-12-23(13-5-1)28-30-25-18-10-16-22-17-11-19-26(27(22)25)31(30)29(24-14-6-2-7-15-24)32(28)33-20-8-3-9-21-33/h1-21H
charge 0 multiplicity 1
54 atoms
N  2.576775 -0.30661 0.000463
C  -0.890014 0.844741 -0.088719
C  -1.063897 -0.595914 0.095695
C  -2.218726 1.474581 -0.11372
C  -2.503715 -0.893222 0.114483
C  -3.1624 0.386801 -0.002254
C  0.4891 1.148013 -0.14895
C  0.202974 -1.218192 0.160939
C  1.168963 -0.134672 0.006842
C  -4.570557 0.55568 -0.007267
C  -2.727338 2.777741 -0.219894
C  -3.306437 -2.039201 0.216819
C  1.09294 2.499944 -0.178013
C  0.465849 -2.675556 0.191788
C  -5.058606 1.905007 -0.118762
C  -5.364428 -0.640065 0.099624
C  -4.150282 2.971473 -0.216304
C  -4.734762 -1.890954 0.203269
C  2.122302 2.881498 0.73122
C  0.638412 3.471716 -1.115023
C  1.35924 -3.295595 -0.729675
C  -0.195995 -3.506772 1.140362
C  3.388736 0.453662 -0.848726
C  3.190647 -1.241239 0.841827
C  2.679216 4.177924 0.697885
C  1.19201 4.769755 -1.145938
C  1.587602 -4.688075 -0.69687
C  0.029795 -4.899886 1.17166
C  4.7767 0.306789 -0.849797
C  4.573153 -1.433078 0.82758
C  2.219038 5.130726 -0.241787
C  0.92584 -5.499505 0.255037
C  5.403236 -0.652185 -0.015196
H  -2.066401 3.646781 -0.294453
H  -2.869904 -3.039687 0.295976
H  -6.138276 2.096559 -0.12633
H  -6.458822 -0.571188 0.099099
H  -4.53596 3.994896 -0.295086
H  -5.352167 -2.794006 0.278615
H  2.463045 2.163581 1.486514
H  -0.140983 3.191017 -1.832749
H  1.851356 -2.682513 -1.493821
H  -0.876552 -3.044649 1.864744
H  2.864487 1.134958 -1.516963
H  2.524515 -1.77708 1.516115
H  3.463461 4.449515 1.414097
H  0.826021 5.497796 -1.879234
H  2.272305 -5.142539 -1.422435
H  -0.489887 -5.516772 1.913983
H  5.359446 0.933611 -1.530356
H  4.995288 -2.182559 1.502657
H  2.649172 6.138196 -0.265093
H  1.100983 -6.580885 0.278217
H  6.488105 -0.784761 -0.020995
