program: Gaussian 09
title: 000143467
version: EM64L-G09RevD.01
frameworkgroup: C1[X(C4H4N4O7)]
method: RPBEPBE
basis: SDD
operation: Freq
keyword: #pfreq=noraman
keyword: PBEPBE/SDD
title: #p freq=noraman PBEPBE/SDD
converged: YES YES NO NO
title: Mulliken charges:
elementType: O O O O O O O N N N N C C C C H H H H
charge: -0.203786 -0.203705 -0.124463 -0.126208 -0.126281 -0.111429 -0.111524 -0.036909 -0.036717 0.211533 0.211505 0.132336 0.132366 -0.358293 -0.358241 0.280859 0.274036 0.280905 0.274015
chargesum: 0.00000
title: Mulliken charges with hydrogens summed into heavy atoms:
elementType: O O O O O O O N N N N C C C C
charge: -0.203786 -0.203705 -0.124463 -0.126208 -0.126281 -0.111429 -0.111524 -0.036909 -0.036717 0.211533 0.211505 0.132336 0.132366 0.196601 0.196679
polarizability: 9.46336242e+01 1.61693642e+00 1.35209295e+02 -1.03129302e+01 4.18164744e-01 8.69883429e+01
1716.lowfreq: -10.0384 -5.5362 -0.0006 -0.0005 0.0004 2.6203 15.8766 35.1616 38.0876
frequency: 15.7378 35.0921 38.0845 46.6375 81.7585 92.9295 132.5974 146.7548 206.2995 206.8721 249.9486 288.8514 338.9706 369.8861 494.5314 523.1680 566.7898 585.0163 592.8236 636.4047 637.2246 677.2659 706.1121 730.5841 747.7838 750.7066 776.6493 857.8197 916.7906 930.0189 938.9995 991.0927 996.6146 1160.3238 1170.0768 1179.6863 1182.8961 1226.6173 1337.0357 1343.5592 1370.8160 1450.0787 1453.6182 1468.2618 1508.5694 1538.0878 1540.6998 3028.3104 3028.6224 3105.3769 3106.6943
redmass: 13.6454 10.9831 13.6203 7.0553 8.7589 11.7998 10.4509 4.7635 12.4147 6.0535 2.9720 11.2660 7.2500 3.7126 9.3374 8.1155 12.3921 13.7251 11.9274 14.0116 13.9643 12.5713 6.0674 7.6473 8.8125 10.8401 5.8442 9.2988 6.4091 10.2725 8.6027 1.7520 2.1758 10.1527 10.4695 1.2965 1.1816 2.7344 1.6249 1.4241 2.8789 1.0741 1.0803 11.2716 8.4930 13.5615 13.7625 1.0574 1.0574 1.1073 1.1075
irintensity: 0.2263 3.2134 0.1788 5.5337 0.4748 4.1493 0.1303 16.5160 0.9926 2.3718 0.6123 4.5679 7.3755 0.2807 0.0000 2.5281 7.0134 33.5389 1.2803 9.3290 3.5207 4.2630 21.3857 5.3786 144.1155 201.1026 218.9904 1.0731 38.5734 35.7648 18.8102 0.1628 3.6028 188.9491 354.3878 1.9866 0.0739 0.2862 1.1288 0.1879 4.4496 11.6967 22.3902 0.0660 4.8081 42.4200 389.4806 2.6134 4.9751 4.7548 0.3509
temp: 298.150 k
press: 1.00000 atm
elementType: 8 8 8 8 8 8 8 7 7 7 7 6 6 6 6 1 1 1 1
symmnumber: 1
zpe: 284149.9 jmol-1
zpe.correction: 0.108227 hartree
zpe.thermalcorrener: 0.122382 hartree
zpe.thermalcorrenthalpy: 0.123326 hartree
zpe.thermalcorrgfe: 0.063136 hartree
zpe.sumelectzpe: -898.934551 hartree
zpe.sumelectthermal: -898.920396 hartree
zpe.sumelectthermalent: -898.919452 hartree
zpe.sumelectthermalfe: -898.979641 hartree
dipole: -0.0055 -0.0800 -0.0012
dipole: 0.0802
quadrupole: -88.0377 -103.5501 -86.8198
quadrupole: -0.6088 -3.5722 0.1361
quadrupole: 4.7648 -10.7476 5.9828 -0.6088 -3.5722 0.1361
hfenergy: -899.0427778 hartree
pointgroup: C01 [X(C4H4N4O7)]
dipole: 0.0008615 0.0315254 -0.0004133 debye
dipolederiv: -0.6004865 -0.4934169 0.0136571 -0.5577338 -1.0154337 0.0410019 -0.0574652 -0.0493735 -0.3213884 -0.6051983 0.4952984 0.0126562 0.5599357 -1.0111988 -0.0391167 -0.059343 0.0507508 -0.3213273 -0.1670517 0.0014419 0.0080149 0.0007535 -0.5025952 0.0005552 -0.1037207 0.0008964 -0.0536778 -0.2839983 -0.2071534 -0.1099871 -0.2320373 -0.4358337 -0.0572942 -0.2329281 -0.2151991 -0.7355424 -0.2855548 0.2071688 -0.110058 0.2322516 -0.4333556 0.0565103 -0.2335202 0.2135193 -0.7365341 -0.2958534 -0.2624032 0.0774531 -0.3612525 -0.6665353 0.2378532 0.1865876 0.3463263 -0.6126382 -0.2990853 0.2644394 0.0785489 0.3636749 -0.6646727 -0.2370043 0.1877203 -0.3447279 -0.6113135 -0.1946313 0.1028479 -0.0267129 0.0125911 0.2212684 -0.0348593 -0.0153649 0.0955346 -0.1312331 -0.1941823 -0.1056944 -0.0267524 -0.0150509 0.2209774 0.0335735 -0.0149337 -0.097263 -0.1309273 0.8252017 0.8706978 0.0336551 1.0594745 1.7588295 -0.1800654 0.1779976 0.050697 1.3750663 0.8331526 -0.874014 0.0335529 -1.0637636 1.7502622 0.1783911 0.1798046 -0.0518491 1.3750878 0.1823837 0.1845491 0.017988 0.1205403 -0.0532995 0.0766558 0.0938243 0.2296427 0.0378129 0.1844396 -0.1833534 0.0188481 -0.1186709 -0.0556901 -0.0759539 0.0953347 -0.228611 0.0383758 0.4204512 0.1263806 -0.019116 0.1486086 0.4449879 -0.0447118 -0.2061956 -0.3097159 0.2967695 0.4223577 -0.1269566 -0.0187211 -0.1492849 0.444442 0.0443225 -0.2069664 0.308352 0.2957952 0.0498358 -0.0239009 0.0546871 -0.0100981 -0.0317761 -0.0501267 0.0913971 0.0453179 0.0579859 -0.0206156 -0.0013851 -0.0460033 0.0074212 0.0308747 0.0401656 0.0129668 0.0631877 0.0596514 0.0494781 0.0242858 0.054137 0.0103288 -0.0317244 0.0504807 0.0915639 -0.0444719 0.0582327 -0.0206427 0.0011682 -0.0458478 -0.0076881 0.0304733 -0.0403775 0.0132408 -0.0630132 0.0598044 unknown
polarizability: 92.4329049|-0.0944142|135.2733182|10.8704466|-0.0427241|89.1250386 unknown
InChI: InChI=1S/C4H4N4O7/c9-7(10)13-1-3-4(6-15-5-3)2-14-8(11)12/h1-2H2
charge 0 multiplicity 1
19 atoms
O  1.736972 0.513053 -0.330913
O  -1.741697 0.502945 0.333569
O  0.009615 -3.529121 0.006909
O  2.749989 1.997142 1.240597
O  -2.758807 1.979759 -1.242064
O  2.759806 2.482942 -1.005657
O  -2.773732 2.469606 1.003256
N  1.018528 -2.698855 0.630171
N  -1.003196 -2.706396 -0.619006
N  2.49752 1.804942 0.014631
N  -2.507003 1.790826 -0.015412
C  0.617681 -1.436975 0.388799
C  -0.6097 -1.441642 -0.381327
C  1.394922 -0.263813 0.900913
C  -1.393807 -0.274473 -0.896707
H  0.780698 0.36489 1.568935
H  2.310817 -0.589626 1.420013
H  -0.782943 0.356733 -1.565351
H  -2.30736 -0.607138 -1.415555
