program: Gaussian 09
title: 000010197
version: EM64L-G09RevD.01
frameworkgroup: C1[X(C15H25NO5)]
method: RPBEPBE
basis: SDD
operation: Freq
keyword: #p
keyword: freq=noraman
keyword: PBEPBE/SDD
title: #p freq=noraman PBEPBE/SDD
converged: YES YES NO NO
title: Mulliken charges:
elementType: O O O O O N C C C C C C C C C C C C C C C H H H H H H H H H H H H H H H H H H H H H H H H H
charge: -0.442130 -0.264971 -0.495484 -0.434318 -0.263692 -0.118034 -0.285794 -0.130664 -0.396526 -0.481256 0.456573 -0.410257 -0.442898 -0.445290 0.124389 -0.004763 -0.093248 0.157097 -0.738162 -0.749512 -0.743947 0.259490 0.246551 0.239409 0.166971 0.253502 0.227202 0.200465 0.237579 0.257205 0.271184 0.245978 0.341304 0.237249 0.243394 0.208525 0.217351 0.243709 0.209968 0.238823 0.240906 0.241234 0.219950 0.227166 0.371578 0.356193
chargesum: 0.00000
title: Mulliken charges with hydrogens summed into heavy atoms:
elementType: O O O O O N C C C C C C C C C C C C C C C
charge: -0.100826 -0.264971 -0.123906 -0.078125 -0.263692 -0.118034 -0.026304 0.115888 0.009855 -0.000552 0.456573 0.027787 -0.185693 0.071871 0.124389 0.232486 0.150146 0.157097 -0.068577 -0.059814 -0.055597
polarizability: 2.12177559e+02 -1.23033431e+01 1.76495855e+02 -6.48889327e+00 -3.43393149e+00 1.57485868e+02
1716.lowfreq: -15.0403 -5.3725 -1.6843 0.0004 0.0005 0.0007 10.8751 20.9230 42.9809
frequency: -6.3965 20.5396 42.9404 49.0934 61.4152 72.0933 80.9387 90.4414 136.0441 161.7709 172.0655 177.3074 198.5829 213.3899 222.5249 232.0131 237.5376 239.9092 268.2337 280.7390 285.1480 301.0549 317.6510 330.8439 358.3014 376.3684 389.2346 396.9825 422.2044 442.8682 465.2085 491.5886 503.4304 523.2551 546.2821 584.9582 587.8275 657.9927 696.3566 700.6896 719.1984 773.2483 796.3622 810.3478 828.6764 855.5543 862.4746 867.5270 881.5012 900.1802 921.4719 936.2034 945.2636 955.7647 958.9855 966.6115 984.9391 998.1209 999.0845 1003.5623 1029.6729 1035.8577 1068.4730 1087.8917 1109.5364 1111.0601 1125.5220 1131.6734 1151.8561 1152.1958 1163.7303 1182.1866 1184.7773 1186.9761 1190.8283 1214.2844 1222.5059 1234.1099 1241.1596 1250.8187 1289.2050 1292.8540 1297.1562 1306.5642 1318.1852 1319.8316 1331.8157 1337.6299 1343.5200 1362.4541 1368.3578 1377.7807 1379.1112 1385.9586 1396.9014 1449.7436 1461.7519 1465.0994 1468.6633 1476.3204 1477.5317 1478.9826 1482.7115 1496.2351 1510.7566 1592.4827 1669.9254 2847.8267 2922.7230 2959.7050 2965.8180 2973.0027 2981.8047 2987.3311 3010.6850 3011.8892 3014.6557 3029.0532 3065.3493 3067.6469 3076.1698 3083.7575 3083.9066 3084.9936 3088.7184 3093.7819 3096.5202 3100.7039 3158.7471 3448.2331 3501.6366 3548.5760
redmass: 4.2318 4.4547 4.5277 3.9424 3.7739 3.9046 3.5385 4.5262 4.3200 3.6706 3.6395 2.7030 4.0635 3.8756 1.0876 1.5072 1.1512 1.6333 1.4164 2.3052 4.7010 2.7630 3.2577 2.4463 3.5733 3.6518 2.4518 2.7829 1.4913 2.5041 2.5173 3.4976 3.5846 1.2006 3.9241 4.5876 4.4792 3.8913 4.1110 4.2063 2.7992 2.8663 4.8439 2.1282 1.9803 4.5221 3.0211 3.6423 2.6040 2.0418 1.2015 2.0520 2.0417 2.3671 2.1587 1.9200 2.1067 1.7986 3.1487 1.8812 1.8305 1.7447 2.5433 2.3337 2.2136 1.9687 2.4256 2.5625 1.3364 2.0265 1.4551 2.0713 1.5916 2.1846 1.4120 1.7616 1.4926 1.2231 1.4921 1.5198 1.3733 1.4297 1.4488 1.4240 1.3652 1.5070 2.3010 1.3752 1.5839 1.5975 1.2270 1.2180 1.1574 1.2319 1.2060 1.0931 1.0818 1.0516 1.0543 1.0485 1.0483 1.0827 1.0495 1.0507 1.0833 9.6786 7.7202 1.0731 1.0643 1.0844 1.0959 1.0378 1.0368 1.0359 1.0833 1.0579 1.0708 1.0800 1.0977 1.0922 1.0983 1.0923 1.1004 1.0956 1.0993 1.1000 1.1024 1.0984 1.0968 1.0650 1.0647 1.0658
irintensity: 0.0595 0.1299 0.7684 0.0984 0.5798 3.2990 0.9536 1.7251 0.2215 1.6544 4.0108 2.3197 1.8917 5.9029 0.4022 10.6403 0.2724 54.3339 70.6024 17.4062 10.5153 3.9409 17.7324 12.5653 11.9247 8.8213 2.8531 6.6737 18.4868 1.2961 10.7291 6.2943 6.7350 239.2589 5.8854 9.8469 14.9429 12.9551 7.1438 9.6661 5.3832 5.1803 24.2011 53.8187 10.9018 42.4139 4.7362 4.2871 11.6242 8.2233 5.1122 32.4808 5.5091 6.2059 30.0956 80.8703 12.5187 4.2736 22.5056 1.5652 12.9200 41.2792 29.8007 138.8902 81.9639 28.4818 16.5656 75.0216 5.3907 44.0059 9.5915 150.4918 116.9764 73.2545 23.5919 7.9184 12.9723 1.2770 9.0086 1.6677 8.8134 51.4898 4.8010 0.9111 7.6602 6.5199 2.2554 1.5227 1.1723 9.4668 45.8290 21.5363 25.4769 25.4347 12.8065 12.6213 17.9588 5.5379 0.1830 5.5493 16.6747 8.0709 5.3676 18.5625 6.4747 176.3628 2.0767 113.0582 82.1945 32.8774 45.9943 25.6823 19.3854 22.6514 4.3046 6.9116 14.4954 65.5566 29.3109 10.4252 39.6987 71.9282 2.4221 19.2857 23.7067 22.5437 21.4425 24.3365 10.6601 50.0923 17.1091 3.9392
temp: 298.150 k
press: 1.00000 atm
elementType: 8 8 8 8 8 7 6 6 6 6 6 6 6 6 6 6 6 6 6 6 6 1 1 1 1 1 1 1 1 1 1 1 1 1 1 1 1 1 1 1 1 1 1 1 1 1
symmnumber: 1
zpe: 1009150.5 jmol-1
zpe.correction: 0.384365 hartree
zpe.thermalcorrener: 0.406521 hartree
zpe.thermalcorrenthalpy: 0.407466 hartree
zpe.thermalcorrgfe: 0.333424 hartree
zpe.sumelectzpe: -1015.756887 hartree
zpe.sumelectthermal: -1015.734730 hartree
zpe.sumelectthermalent: -1015.733786 hartree
zpe.sumelectthermalfe: -1015.807828 hartree
dipole: 4.5534 -1.7263 0.5277
dipole: 4.8981
quadrupole: -120.4953 -124.1009 -136.9496
quadrupole: -0.4450 -0.4954 -1.5707
quadrupole: 6.6866 3.0811 -9.7677 -0.4450 -0.4954 -1.5707
hfenergy: -1016.1412518 hartree
pointgroup: C01 [X(C15H25N1O5)]
dipole: -1.7303474 0.805788 0.2649971 debye
polarizability: 210.2186312|-15.1301772|178.3118149|5.4072123|4.0184079|157.6288359 unknown
InChI: InChI=1S/C15H25NO5/c1-9(2)15(20,10(3)17)14(19)21-8-11-4-6-16-7-5-12(18)13(11)16/h4,9-10,12-13,17-18,20H,5-8H2,1-3H3
charge 0 multiplicity 1
46 atoms
O  -2.849473 -1.298892 1.542457
O  0.667218 0.455505 0.435398
O  4.12004 -0.753643 0.777809
O  3.561378 -2.157015 -1.53118
O  2.075124 0.13681 2.260407
N  -3.476777 0.770022 -0.949707
C  -2.201491 0.127745 -0.45259
C  -2.616899 -1.280481 0.085582
C  -4.604604 -0.188774 -0.792203
C  -3.908469 -1.570345 -0.716899
C  -1.656492 1.119701 0.569069
C  -3.624916 2.117347 -0.327868
C  -2.446439 2.223957 0.628604
C  -0.440106 0.841081 1.392269
C  2.921164 -0.360668 0.007718
C  3.380686 0.767692 -0.978818
C  2.438068 -1.662233 -0.726967
C  1.86645 0.107262 1.018644
C  3.752738 2.053611 -0.204339
C  2.391427 1.067401 -2.127875
C  1.933731 -2.750265 0.237351
H  -1.475492 -0.012196 -1.27901
H  -1.832364 -2.038505 -0.061675
H  -5.312629 -0.129614 -1.63836
H  -5.193676 0.006996 0.140789
H  -4.523212 -2.345041 -0.230148
H  -3.643708 -1.914551 -1.73318
H  -4.601085 2.213666 0.199888
H  -3.594112 2.928244 -1.085315
H  -2.270477 3.101358 1.25917
H  -0.597102 -0.017848 2.070066
H  -0.106948 1.713111 1.980115
H  -3.54107 -0.624961 1.767732
H  4.303904 0.351709 -1.427155
H  1.654238 -1.403046 -1.45561
H  2.853298 2.555576 0.202614
H  4.255346 2.770733 -0.87803
H  4.440098 1.82983 0.629869
H  2.786796 1.899875 -2.738683
H  1.398993 1.365734 -1.746682
H  2.269757 0.198463 -2.79735
H  1.719588 -3.667756 -0.336222
H  1.00662 -2.442381 0.756849
H  2.69933 -2.985838 0.998311
H  3.900104 -0.66298 1.746756
H  4.335147 -2.221499 -0.908202
