program: Gaussian 09
title: 000143456
version: EM64L-G09RevD.01
frameworkgroup: C1[X(C4H8BrF)]
method: RPBEPBE
basis: SDD
operation: Freq
keyword: #p
keyword: freq=noraman
keyword: PBEPBE/SDD
title: #p freq=noraman PBEPBE/SDD
converged: YES YES NO NO
title: Mulliken charges:
elementType: Br F C C C C H H H H H H H H
charge: -0.030305 -0.230843 -0.428505 0.100363 -0.648639 -0.706402 0.274696 0.233847 0.244542 0.270214 0.219116 0.215575 0.249875 0.236467
chargesum: 0.00000
title: Mulliken charges with hydrogens summed into heavy atoms:
elementType: Br F C C C C
charge: -0.030305 -0.230843 -0.153809 0.334210 0.085232 -0.004485
polarizability: 7.87963310e+01 -7.76717218e+00 5.21494879e+01 4.32003039e+00 3.51834466e-01 4.50775072e+01
1716.lowfreq: -22.9604 -16.3404 -9.2349 0.0006 0.0007 0.0011 53.3832 168.9715 208.9095
frequency: 52.8941 168.9660 208.9094 219.5977 246.7896 279.3851 286.2632 411.8515 586.3123 596.1705 774.4205 871.6583 962.8020 986.6714 1039.3632 1060.9077 1113.9435 1160.6994 1192.9524 1285.1127 1316.5343 1335.9362 1386.7921 1392.0392 1457.6843 1462.2630 1471.3795 1480.0397 2988.7767 2997.7280 3042.5573 3062.3468 3087.2018 3095.8167 3110.0163 3126.5607
redmass: 3.9598 4.9313 1.1174 1.1976 2.9902 2.4969 3.5585 3.4991 2.9438 3.2640 3.0843 2.3548 1.4650 1.6423 1.5135 1.9238 2.2594 1.8365 1.2855 1.3412 1.5212 1.3163 1.2263 1.2045 1.0531 1.0410 1.0516 1.0489 1.0406 1.0364 1.0872 1.0869 1.0924 1.0983 1.1003 1.1013
irintensity: 1.6591 0.0663 0.1751 0.3756 5.3083 0.1943 4.4835 17.5036 3.6694 14.5977 10.6669 25.9832 16.0691 21.2363 26.0461 40.4959 4.9131 29.4735 26.6106 3.0722 2.4191 4.0667 21.4168 21.6483 7.0741 18.7632 10.5432 9.4421 15.8837 13.6804 12.9194 8.3654 21.4903 22.3087 22.9062 10.9227
temp: 298.150 k
press: 1.00000 atm
elementType: 35 9 6 6 6 6 1 1 1 1 1 1 1 1
symmnumber: 1
zpe: 294995.2 jmol-1
zpe.correction: 0.112358 hartree
zpe.thermalcorrener: 0.120129 hartree
zpe.thermalcorrenthalpy: 0.121073 hartree
zpe.thermalcorrgfe: 0.079057 hartree
zpe.sumelectzpe: -270.028816 hartree
zpe.sumelectthermal: -270.021044 hartree
zpe.sumelectthermalent: -270.020100 hartree
zpe.sumelectthermalfe: -270.062116 hartree
dipole: -2.3570 1.4910 -2.4263
dipole: 3.6967
quadrupole: -45.3596 -44.6034 -47.5151
quadrupole: -0.9502 4.0868 1.9290
quadrupole: 0.4664 1.2227 -1.6891 -0.9502 4.0868 1.9290
hfenergy: -270.1411733 hartree
pointgroup: C01 [X(C4H8Br1F1)]
dipole: -0.8229977 -0.9630078 0.7145011 debye
dipolederiv: -0.5316243 -0.1999612 -0.0442639 -0.2166542 -0.3261259 -0.0599383 -0.0241756 -0.04421 -0.1553529 -0.3732383 0.0319685 -0.0088369 0.0421464 -0.3743743 0.165658 -0.0324094 0.1942751 -0.6203118 0.6580233 0.4126666 0.0168485 0.441833 0.4102962 0.1279725 0.0635221 0.0600564 0.1162992 0.4009542 -0.0270766 -0.0094864 -0.2099663 0.3530137 -0.1914257 0.0892319 -0.1458861 0.6632205 -0.1193231 -0.0873642 -0.03313 -0.0202611 -0.1233741 -0.1220447 0.0210466 -0.039681 -0.0398217 -0.2250489 -0.1089495 0.0619793 0.0614098 0.0012518 0.0563313 -0.0607823 0.0186378 0.0180909 -0.0269168 -0.0759526 0.0385736 -0.0536241 -0.0121492 0.0497743 0.0150977 0.0319985 -0.0836878 0.0449005 -0.0131845 -0.0061228 0.0061371 -0.0741595 -0.0866948 -0.0012019 -0.050199 -0.0444689 -0.0482596 0.1254498 -0.0107239 0.0953412 0.04102 0.0028558 -0.0347521 0.0069856 0.0895935 0.1284661 0.0107936 -0.0035016 -0.0133783 0.0762361 0.090558 0.0056438 0.032748 -0.0386017 -0.0318999 -0.1370327 0.0121224 -0.1580273 -0.0181597 -0.0217237 -0.0185968 -0.0410908 0.0721695 0.113635 0.002523 -0.0296797 -0.0176723 0.0753193 0.0769014 0.0051192 0.0769886 -0.1065641 -0.0980706 0.0699343 -0.005894 0.0882637 0.0129883 0.0133668 -0.0127977 0.0150143 0.1165217 0.1084024 -0.0038145 0.0221153 -0.0455476 -0.0417829 -0.1015909 -0.0149457 -0.1156372 0.0129136 unknown
polarizability: 73.9121871|13.3764691|56.8769026|0.638951|2.8140172|45.2342364 unknown
InChI: InChI=1S/C4H8BrF/c1-3(5)4(2)6/h3-4H,1-2H3
charge 0 multiplicity 1
14 atoms
Br 2.202683 0.793684 0.458848
F  -0.777099 0.953421 -1.083232
C  0.551579 -0.431092 0.431185
C  -0.70983 0.436121 0.291796
C  0.740986 -1.486192 -0.660557
C  -2.010491 -0.331067 0.559388
H  0.572196 -0.871742 1.442826
H  -0.633645 1.325378 0.943313
H  1.675795 -2.047813 -0.504017
H  0.769969 -1.012443 -1.654459
H  -0.100184 -2.206092 -0.640581
H  -2.031679 -0.715583 1.59544
H  -2.869349 0.347545 0.425609
H  -2.130231 -1.177725 -0.136957
