program: Gaussian 09
title: 000143447
version: EM64L-G09RevD.01
frameworkgroup: C1[X(C3H4F2)]
method: RPBEPBE
basis: SDD
operation: Freq
keyword: #p
keyword: freq=noraman
keyword: PBEPBE/SDD
title: #p freq=noraman PBEPBE/SDD
converged: YES YES NO YES
title: Mulliken charges:
elementType: F F C C C H H H H
charge: -0.201566 -0.201567 -0.019808 -0.019809 -0.526961 0.221245 0.221245 0.244617 0.282603
chargesum: 0.00000
title: Mulliken charges with hydrogens summed into heavy atoms:
elementType: F F C C C
charge: -0.201566 -0.201567 0.201437 0.201436 0.000259
polarizability: 3.09392936e+01 6.88738460e-06 3.13134168e+01 1.35916839e-06 -5.84201770e-01 2.85086323e+01
1716.lowfreq: -0.0019 -0.0018 -0.0017 14.7458 15.7066 22.2307 188.8740 301.4283 442.3494
frequency: 188.8739 301.4272 442.3491 580.1770 719.7374 776.6964 832.1888 992.6814 1026.2253 1067.9579 1085.5257 1103.1152 1123.9481 1216.4676 1316.3279 1358.9819 1430.8686 3107.9484 3143.9148 3157.7182 3217.4181
redmass: 14.1044 3.1851 2.6680 5.3790 2.4243 2.1776 1.8659 2.2079 4.3145 1.4563 1.7503 1.3715 1.5684 1.5037 1.2572 1.7028 1.4036 1.0558 1.0885 1.0966 1.1153
irintensity: 1.9814 0.8665 4.9176 16.8466 11.7290 55.5072 8.0000 1.9889 20.6817 57.1847 11.2077 2.8735 16.8501 25.9968 11.7808 16.6239 35.5281 1.1905 5.6347 31.3768 5.9669
temp: 298.150 k
press: 1.00000 atm
elementType: 9 9 6 6 6 1 1 1 1
symmnumber: 1
zpe: 168616.9 jmol-1
zpe.correction: 0.064223 hartree
zpe.thermalcorrener: 0.068968 hartree
zpe.thermalcorrenthalpy: 0.069913 hartree
zpe.thermalcorrgfe: 0.036380 hartree
zpe.sumelectzpe: -315.948008 hartree
zpe.sumelectthermal: -315.943262 hartree
zpe.sumelectthermalent: -315.942318 hartree
zpe.sumelectthermalfe: -315.975850 hartree
dipole: 0.0000 3.2624 1.3938
dipole: 3.5476
quadrupole: -31.6168 -28.3764 -25.2465
quadrupole: 0.0000 0.0000 0.3734
quadrupole: -3.2036 0.0369 3.1667 0.0000 0.0000 0.3734
hfenergy: -316.0122307 hartree
pointgroup: C01 [X(C3H4F2)]
dipole: 0.0002833 1.2567031 -0.6072899 debye
dipolederiv: -0.4690892 -0.2009265 0.0158601 -0.2960687 -0.5480112 0.0576068 0.1609085 0.1724257 -0.308889 -0.4688629 0.200902 -0.0158199 0.296034 -0.5482532 0.0575918 -0.1608133 0.1724901 -0.3088751 0.3931777 0.1478573 -0.09187 0.2283655 0.6214059 -0.0483826 -0.154714 -0.1116107 0.4418955 0.3930062 -0.1477545 0.0918508 -0.2282578 0.6215857 -0.0484149 0.154663 -0.1116803 0.4418716 -0.1175109 -0.0000304 -0.0000482 -0.0000253 -0.2085438 -0.1765306 -0.0000803 -0.3143088 -0.273249 -0.0027458 -0.0288116 -0.0919242 -0.0321322 0.03582 0.0590489 -0.0784925 0.0727674 -0.04003 -0.0027035 0.0288359 0.0919494 0.0321545 0.0357899 0.0590044 0.0785244 0.0727279 -0.0400398 0.1193776 -0.0000528 0.0000023 -0.0000513 -0.0870373 0.0154314 0.0000066 0.034514 0.0828758 0.1553509 -0.0000194 -0.0000003 -0.0000187 0.077244 0.0246449 -0.0000024 0.0126747 0.00444 unknown
polarizability: 30.9392936|0.0001127|31.3615041|0.0000245|0.4517797|28.460545 unknown
InChI: InChI=1S/C3H4F2/c4-2-1-3(2)5/h2-3H,1H2
charge 0 multiplicity 1
9 atoms
F  -1.435472 -0.838115 0.227111
F  1.435117 -0.838815 0.227008
C  -0.762155 0.233386 -0.434463
C  0.762269 0.233013 -0.434518
C  0.00033 1.226734 0.444498
H  -1.312477 0.553887 -1.324689
H  1.312683 0.553255 -1.324779
H  0.000593 2.290256 0.190772
H  0.000312 0.996899 1.515061
