program: Gaussian 09
title: 000143434
version: EM64L-G09RevD.01
frameworkgroup: C1[X(C11H16O2)]
method: RPBEPBE
basis: SDD
operation: Freq
keyword: #pfreq=noraman
keyword: PBEPBE/SDD
title: #p freq=noraman PBEPBE/SDD
converged: YES YES NO NO
title: Mulliken charges:
elementType: O O C C C C C C C C C C C H H H H H H H H H H H H H H H H
charge: -0.271821 -0.422342 0.120374 0.410940 0.240685 0.507002 -0.683419 -0.542395 -0.813647 -0.821476 -0.821901 -0.270547 -0.335667 0.234903 0.240773 0.223226 0.278882 0.215200 0.225791 0.227322 0.228249 0.227011 0.224877 0.225439 0.205480 0.199905 0.180701 0.233826 0.332625
chargesum: 0.00000
title: Mulliken charges with hydrogens summed into heavy atoms:
elementType: O O C C C C C C C C C C C
charge: -0.271821 -0.089717 0.120374 0.410940 0.240685 0.507002 -0.448515 -0.301622 -0.096339 -0.140113 -0.144573 0.134838 0.078860
polarizability: 1.57734309e+02 5.52286949e-01 1.47141720e+02 -5.25142600e+00 7.44096579e-01 8.01070177e+01
1716.lowfreq: -10.3787 -5.2560 -0.0004 0.0002 0.0006 5.8358 34.1142 42.2744 51.8991
frequency: 34.0561 42.2042 51.8713 72.1147 105.1936 125.4459 140.3249 147.7481 191.5035 217.8683 234.6837 272.1382 297.3553 316.5573 327.1686 334.9456 439.1316 470.2554 520.0860 538.4730 551.7537 588.9506 620.3475 726.8419 750.0515 832.4773 839.4153 866.2651 872.2765 928.5240 966.3406 1005.1345 1015.0732 1017.1115 1024.0953 1029.9290 1046.2106 1053.4130 1076.9436 1102.9345 1146.5484 1166.9442 1216.9691 1247.4455 1253.1164 1301.9845 1319.9677 1367.5998 1381.4409 1390.5547 1392.4801 1394.6861 1401.9664 1413.0131 1454.4858 1455.9593 1464.5155 1467.1368 1470.7842 1474.2992 1480.5189 1487.2063 1498.7206 1592.4962 1619.3237 2922.8146 2949.0773 2969.4345 2971.4647 2972.3333 2984.6185 3039.2602 3044.1645 3049.0732 3082.1610 3083.9137 3090.2849 3115.8506 3120.7527 3141.8578 3558.0269
redmass: 1.0964 3.9986 3.2895 1.0332 3.2056 2.6536 2.0491 1.1899 2.8757 2.2672 3.1511 2.0849 2.0828 2.2266 3.4408 3.4124 4.1544 3.6095 3.4333 3.0103 3.8335 3.9184 3.8138 2.5251 4.0391 2.7164 1.7021 1.6928 1.7833 2.1035 2.7954 1.7325 1.5739 1.7849 1.4258 1.7224 1.5480 1.6266 2.5763 3.5849 2.8178 1.1808 1.9306 1.4303 1.1912 3.9476 1.3175 1.9050 2.2002 1.3012 1.3484 1.2650 1.2483 2.4872 1.0978 1.2351 1.0573 1.0862 1.0473 1.2175 1.1312 1.0696 2.2199 6.2965 6.3992 1.0565 1.0707 1.0378 1.0405 1.0374 1.1035 1.0961 1.0964 1.0975 1.0984 1.0982 1.0928 1.0959 1.0914 1.0904 1.0662
irintensity: 0.0190 0.8986 5.6093 1.1798 2.6891 9.6998 21.4177 2.3157 2.7926 64.3931 13.7401 43.2716 34.7037 21.6217 0.5350 3.7107 4.2419 8.5577 0.1030 0.7156 0.6597 6.5617 20.8308 2.3608 1.0388 8.7844 19.1058 32.2636 14.0765 12.8752 20.6058 7.5487 11.0128 43.6486 4.7182 30.5399 14.2648 1.5052 28.3328 163.7542 33.6934 22.9964 6.0869 23.5871 1.0517 112.1892 4.9367 0.9243 20.4479 21.5100 4.1394 6.3000 18.3712 16.9364 6.3798 1.5019 4.2717 30.6735 12.9023 4.2416 29.8689 26.1996 42.3099 78.7152 23.7196 26.9496 105.7046 65.0342 17.8471 35.1348 57.2840 44.7906 2.1424 24.7244 17.6748 25.5056 20.4995 3.8080 24.3389 13.9119 5.7217
temp: 298.150 k
press: 1.00000 atm
elementType: 8 8 6 6 6 6 6 6 6 6 6 6 6 1 1 1 1 1 1 1 1 1 1 1 1 1 1 1 1
symmnumber: 1
zpe: 638497.6 jmol-1
zpe.correction: 0.243191 hartree
zpe.thermalcorrener: 0.258219 hartree
zpe.thermalcorrenthalpy: 0.259163 hartree
zpe.thermalcorrgfe: 0.200005 hartree
zpe.sumelectzpe: -578.200900 hartree
zpe.sumelectthermal: -578.185872 hartree
zpe.sumelectthermalent: -578.184928 hartree
zpe.sumelectthermalfe: -578.244086 hartree
dipole: -0.5058 2.7306 0.1677
dipole: 2.7821
quadrupole: -79.2096 -72.9314 -78.1342
quadrupole: 11.3516 -0.6726 1.2259
quadrupole: -2.4512 3.8270 -1.3758 11.3516 -0.6726 1.2259
hfenergy: -578.444091 hartree
pointgroup: C01 [X(C11H16O2)]
dipole: -0.3614324 1.0209441 0.1584302 debye
polarizability: 157.6090891|2.3570221|146.8339769|-2.2649095|6.9247251|80.5399805 unknown
InChI: InChI=1S/C11H16O2/c1-8-6-9(2)10(3)11(7-8)13-5-4-12/h6-7,12H,4-5H2,1-3H3
charge 0 multiplicity 1
29 atoms
O  1.641092 -0.026355 -0.090513
O  4.384027 0.051727 1.077158
C  -0.421502 -1.244149 -0.090728
C  -1.840986 -1.264929 -0.019918
C  0.232449 0.018483 0.002267
C  -1.907437 1.193141 0.240804
C  -2.563439 -0.053566 0.142942
C  -0.492306 1.221157 0.167523
C  0.384046 -2.518411 -0.264339
C  -2.589384 -2.58315 -0.115861
C  -2.690283 2.483468 0.422549
C  2.384403 1.220019 0.086286
C  3.877344 0.900783 -0.002838
H  -3.658458 -0.089302 0.194075
H  0.02369 2.184899 0.234152
H  0.221543 -2.962734 -1.26626
H  1.460154 -2.320875 -0.150772
H  0.086942 -3.284103 0.476881
H  -2.348261 -3.122128 -1.052022
H  -2.324144 -3.263112 0.716976
H  -3.680703 -2.424333 -0.086958
H  -2.466361 2.957901 1.397361
H  -2.442558 3.221724 -0.363404
H  -3.777938 2.3016 0.382114
H  2.115949 1.944403 -0.71326
H  2.13298 1.679439 1.068615
H  4.432342 1.864474 -0.047232
H  4.08205 0.331808 -0.924241
H  4.10905 0.429722 1.950845
