program: Gaussian 09
title: 000143420
version: EM64L-G09RevD.01
frameworkgroup: C1[X(C21H20)]
method: RPBEPBE
basis: SDD
operation: Freq
keyword: #p
keyword: freq=noraman
keyword: PBEPBE/SDD
title: #p freq=noraman PBEPBE/SDD
converged: YES YES NO NO
title: Mulliken charges:
elementType: C C C C C C C C C C C C C C C C C C C C C H H H H H H H H H H H H H H H H H H H H
charge: -0.013349 -0.457783 -0.582955 -0.673160 -0.569377 0.289837 0.289061 0.443083 -0.400575 -0.398319 0.165631 -0.455896 -0.252005 -0.250128 0.396878 -0.385889 -0.254618 -0.462739 -0.440396 -0.271940 -0.243628 0.241988 0.211814 0.202310 0.242678 0.207023 0.213578 0.223811 0.222609 0.220620 0.232996 0.229441 0.235646 0.224596 0.224585 0.240373 0.225255 0.238400 0.236795 0.225782 0.227971
chargesum: 0.00000
title: Mulliken charges with hydrogens summed into heavy atoms:
elementType: C C C C C C C C C C C C C C C C C C C C C
charge: 0.228639 -0.043659 -0.133254 -0.235772 -0.126147 0.289837 0.289061 0.443083 -0.167579 -0.168879 0.165631 -0.220250 -0.027410 -0.025543 0.396878 -0.145516 -0.029363 -0.224339 -0.203601 -0.046159 -0.015658
polarizability: 2.51215145e+02 5.96399389e+00 2.38019772e+02 -1.84860857e+01 6.56481958e+00 1.68071248e+02
1716.lowfreq: -10.2278 -4.3707 0.0002 0.0003 0.0006 5.5125 21.8008 33.7224 45.7970
frequency: 21.0534 33.6836 45.7882 72.3410 127.5279 128.0507 179.6106 185.6230 209.4453 246.5191 257.0155 304.7819 348.3233 386.0682 420.4920 429.8152 432.7657 443.9927 456.8395 473.9116 496.6897 506.4297 510.5955 554.3743 581.7523 599.3846 617.9392 657.2363 703.9842 710.6837 724.9561 744.3708 749.8511 783.9245 790.2966 804.4615 816.8073 841.5073 858.8343 865.3389 881.0617 884.7906 909.6158 917.5047 924.3379 955.7011 959.7220 983.3772 984.4111 991.8812 1008.3324 1016.3301 1034.6988 1036.8700 1047.4928 1074.9047 1084.5393 1111.6476 1118.8595 1139.3156 1149.3108 1167.6172 1172.9185 1174.5770 1181.3610 1194.8316 1203.6480 1221.2256 1236.3616 1246.3150 1249.4966 1268.6308 1273.5522 1284.0172 1307.3761 1324.7383 1339.7912 1348.7883 1359.6785 1379.3269 1382.3263 1405.8105 1416.7097 1439.4431 1441.4010 1452.9709 1455.2760 1458.3973 1466.4736 1480.4945 1491.0180 1517.7018 1589.4041 1591.4825 1597.9311 1613.7107 1632.4622 2937.4063 2956.0936 2964.4419 2969.4707 2977.3396 3016.6489 3024.1225 3025.5820 3035.5536 3107.5956 3111.8753 3115.9234 3119.9705 3126.6835 3130.9726 3133.5237 3148.3081 3153.7043 3156.4059 3163.1180
redmass: 4.5625 4.0319 4.7286 3.7797 2.7876 4.1195 4.1219 3.2020 3.1822 4.1110 2.5876 2.6841 3.3848 3.8344 2.6376 2.7669 3.1504 2.3071 3.3372 3.2768 4.4838 4.2683 5.1295 4.0259 3.9995 4.4546 3.7257 3.2614 4.1989 3.4344 4.0876 1.2671 1.2436 3.8611 2.4220 1.6817 1.8845 2.2378 2.4121 2.0587 1.5577 1.9923 1.6013 1.9540 1.6660 1.4167 1.3816 1.3511 1.3201 1.3533 2.7312 3.3861 2.1923 2.5039 2.5301 2.3518 2.0923 1.9543 2.0181 1.1940 1.4254 1.2427 1.0644 1.1174 1.2177 2.4775 1.3662 1.7989 1.8735 1.5838 1.4556 1.4699 1.3906 1.4706 1.3943 1.4178 1.4748 1.5197 1.7321 2.1057 5.0658 2.9662 5.3317 2.3933 2.3775 1.1502 2.5125 1.0870 1.1084 1.1179 2.2696 3.7388 7.5757 6.6018 5.2861 6.3820 6.5569 1.0679 1.0644 1.0656 1.0646 1.0724 1.0943 1.1004 1.0954 1.1002 1.0863 1.0892 1.0869 1.0860 1.0904 1.0884 1.0925 1.0942 1.0992 1.1004 1.0999
irintensity: 0.0104 0.0136 0.0307 0.0755 0.1123 0.0831 2.8589 0.4486 0.6636 1.1837 6.6118 1.2227 0.6921 0.0494 1.3069 5.8253 8.4700 4.6305 3.1259 0.6767 0.6042 0.3373 1.1305 2.3648 0.4917 3.5810 1.8244 0.5942 0.8340 0.1446 0.7788 6.6236 67.7694 9.9868 48.0428 61.9441 25.8607 1.7165 0.5672 1.6863 0.3008 9.5716 8.1579 1.0913 0.0213 5.1999 1.7137 2.1193 0.0024 1.1739 2.8918 9.1908 3.4488 5.1908 0.9737 1.5063 7.0856 6.3184 8.4461 3.2734 1.1900 1.0108 0.6000 1.1753 0.7611 0.7217 3.0533 1.6208 3.7112 4.5684 2.5233 2.6249 6.5378 3.9279 2.8724 2.0653 1.8250 1.0610 2.3022 9.1947 1.2033 4.6468 4.2269 5.3512 4.2076 3.4451 1.4482 15.0129 3.2642 17.9748 21.7427 8.9275 4.5729 3.0690 7.1186 1.0280 0.3239 18.1878 24.4201 21.0367 7.0591 61.4879 43.9940 5.9054 10.3205 86.6476 16.4512 2.2236 9.3130 1.3301 17.7688 6.5108 29.8982 40.2777 39.8595 38.7971 23.4561
temp: 298.150 k
press: 1.00000 atm
elementType: 6 6 6 6 6 6 6 6 6 6 6 6 6 6 6 6 6 6 6 6 6 1 1 1 1 1 1 1 1 1 1 1 1 1 1 1 1 1 1 1 1
symmnumber: 1
zpe: 903657.7 jmol-1
zpe.correction: 0.344185 hartree
zpe.thermalcorrener: 0.360803 hartree
zpe.thermalcorrenthalpy: 0.361747 hartree
zpe.thermalcorrgfe: 0.298743 hartree
zpe.sumelectzpe: -810.793895 hartree
zpe.sumelectthermal: -810.777278 hartree
zpe.sumelectthermalent: -810.776333 hartree
zpe.sumelectthermalfe: -810.839337 hartree
dipole: 0.2648 -0.4216 0.3850
dipole: 0.6293
quadrupole: -122.2249 -112.1795 -123.8051
quadrupole: 3.6586 -5.3593 -0.3404
quadrupole: -2.8217 7.2236 -4.4019 3.6586 -5.3593 -0.3404
hfenergy: -811.1380803 hartree
pointgroup: C01 [X(C21H20)]
dipole: -0.1142466 0.1615445 0.1488586 debye
polarizability: 250.4245092|7.0408411|238.6118072|18.7516999|-6.5588685|168.2698485 unknown
InChI: InChI=1S/C21H20/c1-2-8-19-14-16(12-13-17(19)6-1)15-20-10-5-9-18-7-3-4-11-21(18)20/h1-11,16H,12-15H2
charge 0 multiplicity 1
41 atoms
C  0.688631 0.640638 0.948304
C  1.665451 1.578063 1.697778
C  1.442198 -0.639423 0.517664
C  -0.555833 0.311902 1.827154
C  2.808141 2.03695 0.767818
C  2.791044 -0.366105 -0.145059
C  3.453389 0.885344 0.000601
C  -1.631886 -0.501392 1.121373
C  3.415692 -1.391275 -0.901062
C  4.722634 1.069901 -0.605001
C  -2.540264 0.112171 0.174394
C  -1.74886 -1.875843 1.373444
C  4.677319 -1.198858 -1.501831
C  5.338143 0.043003 -1.350705
C  -3.530551 -0.710128 -0.497751
C  -2.513047 1.516762 -0.127792
C  -2.723741 -2.685083 0.712342
C  -3.598465 -2.113422 -0.211032
C  -4.432006 -0.103748 -1.434853
C  -3.406533 2.080601 -1.041995
C  -4.374222 1.263937 -1.706848
H  0.345104 1.166262 0.032758
H  2.083075 1.039289 2.57338
H  1.124859 2.462738 2.088769
H  0.809668 -1.245385 -0.157745
H  1.608732 -1.265633 1.421876
H  -0.977707 1.265743 2.202265
H  -0.206754 -0.245168 2.718804
H  3.580883 2.578391 1.347164
H  2.402891 2.769141 0.0377
H  2.899951 -2.353223 -1.018018
H  5.232532 2.035092 -0.487863
H  -1.072961 -2.342898 2.100181
H  5.140346 -2.005125 -2.081853
H  6.320057 0.20701 -1.808936
H  -1.784393 2.161296 0.373973
H  -2.779253 -3.755632 0.93855
H  -4.349671 -2.725533 -0.724314
H  -5.173986 -0.737959 -1.935105
H  -3.36963 3.155212 -1.252945
H  -5.06778 1.716486 -2.424087
