program: Gaussian 09
title: 000143419
version: EM64L-G09RevD.01
frameworkgroup: C1[X(C10H20O)]
method: RPBEPBE
basis: SDD
operation: Freq
keyword: #pfreq=noraman
keyword: PBEPBE/SDD
title: #p freq=noraman PBEPBE/SDD
converged: YES YES NO NO
title: Mulliken charges:
elementType: O C C C C C C C C C C H H H H H H H H H H H H H H H H H H H H
charge: -0.305611 0.081553 -0.412101 -0.417349 -0.169343 0.459673 -0.695762 -0.695237 -0.710156 -0.690607 -0.744972 0.173957 0.214328 0.196507 0.238491 0.208756 0.215381 0.213813 0.237219 0.205197 0.222523 0.213611 0.210100 0.206863 0.224976 0.213785 0.209734 0.210773 0.238583 0.220086 0.225233
chargesum: 0.00000
title: Mulliken charges with hydrogens summed into heavy atoms:
elementType: O C C C C C C C C C C
charge: -0.305611 0.255510 -0.001267 0.029898 0.046037 0.459673 -0.039532 -0.049003 -0.064532 -0.031518 -0.299654
polarizability: 1.28575338e+02 7.11061707e-01 1.13650171e+02 -5.38813476e-01 -7.82920679e+00 9.53149972e+01
1716.lowfreq: -12.5230 -0.0003 0.0002 0.0006 6.3977 19.0466 33.3217 54.7187 62.2298
frequency: 32.4241 54.6749 62.0842 95.6441 104.1405 149.5007 183.2519 209.0034 209.7884 236.4513 244.5539 264.0805 271.9300 321.4608 327.4868 391.7364 405.7046 454.2358 521.1829 534.9344 633.9179 686.1100 741.3636 766.3609 779.3915 824.3438 852.0549 873.7821 916.2515 923.2755 931.8969 958.1685 973.8014 1014.7503 1045.5846 1049.9562 1096.9095 1105.2248 1128.0216 1134.4057 1159.9583 1174.8209 1218.5867 1244.0636 1271.7060 1295.1865 1296.7224 1312.5017 1336.1572 1352.3651 1361.1089 1372.1801 1386.6080 1389.2797 1391.2296 1416.5155 1452.6480 1465.9368 1471.5348 1473.9836 1474.4348 1478.9189 1482.6099 1486.1316 1487.5243 1493.5429 1637.4841 2954.5360 2973.9564 2976.0245 2977.3694 2980.1361 2980.6745 2987.1533 2994.3396 3039.7084 3044.3602 3069.4676 3072.2123 3074.1787 3076.6488 3078.4145 3081.5835 3089.9248 3095.1578 3133.5072 3231.7905
redmass: 2.6863 3.1122 2.4571 2.4464 2.6713 1.8609 1.3776 1.5441 1.1554 2.0807 1.7270 1.1542 2.1192 2.7944 2.5308 2.6781 2.4379 2.7619 3.3857 2.5175 2.6107 1.2185 1.6465 1.5049 1.7569 1.3679 1.7053 1.9938 1.4267 1.4665 1.7442 1.4780 2.5013 1.3126 2.2126 3.0657 1.5646 1.8214 2.4917 2.2219 2.1775 2.0156 1.9371 1.2595 1.1888 1.3090 1.2437 1.2967 1.5948 1.5991 1.6288 1.2416 1.2171 1.2083 1.2172 1.1733 1.0775 1.0507 1.0485 1.0501 1.0463 1.0515 1.0457 1.0684 1.0545 1.0618 5.2813 1.0829 1.0814 1.0363 1.0359 1.0358 1.0366 1.0600 1.0612 1.1002 1.0998 1.1002 1.1004 1.0996 1.0992 1.0993 1.1002 1.0998 1.0993 1.0622 1.1132
irintensity: 0.0124 0.4968 0.1267 0.3904 0.1586 0.8288 0.1407 0.7113 0.3576 1.5889 0.3284 0.5988 0.5671 0.9516 0.9929 3.0325 1.4815 0.5971 4.3911 2.7738 1.4462 0.5142 1.0469 5.5588 0.7454 87.6929 15.7980 16.1103 4.7541 1.0214 15.3223 13.8810 75.4145 10.8243 1.8727 6.7856 25.0793 4.5308 24.7752 5.8896 78.4711 0.1293 106.7354 3.0641 0.8963 1.4908 0.4638 4.0743 23.2751 3.2662 0.3588 9.7987 17.3507 7.7280 31.4429 7.9461 4.1189 7.7019 1.8780 3.9834 5.8643 9.9354 15.5014 14.3052 16.1993 18.2323 112.4291 15.0030 11.3001 36.3679 27.5804 25.9053 51.4190 20.9707 30.3399 13.3420 2.2542 1.3818 32.3759 68.7535 96.9737 38.8215 35.8754 47.2887 32.3382 4.1503 17.3645
temp: 298.150 k
press: 1.00000 atm
elementType: 8 6 6 6 6 6 6 6 6 6 6 1 1 1 1 1 1 1 1 1 1 1 1 1 1 1 1 1 1 1 1
symmnumber: 1
zpe: 728554.0 jmol-1
zpe.correction: 0.277492 hartree
zpe.thermalcorrener: 0.292005 hartree
zpe.thermalcorrenthalpy: 0.292949 hartree
zpe.thermalcorrgfe: 0.236125 hartree
zpe.sumelectzpe: -467.344629 hartree
zpe.sumelectthermal: -467.330116 hartree
zpe.sumelectthermalent: -467.329172 hartree
zpe.sumelectthermalfe: -467.385996 hartree
dipole: 0.8311 -0.2116 0.0729
dipole: 0.8606
quadrupole: -65.7834 -71.6683 -71.4733
quadrupole: -0.2062 0.7853 -0.5109
quadrupole: 3.8583 -2.0267 -1.8317 -0.2062 0.7853 -0.5109
hfenergy: -467.6221207 hartree
pointgroup: C01 [X(C10H20O1)]
dipole: -0.3113362 -0.1208946 -0.0557494 debye
polarizability: 128.2263226|2.8093931|107.4844416|-2.4131724|11.5214769|101.8297415 unknown
InChI: InChI=1S/C10H20O/c1-6-10(7-2)11-9(5)8(3)4/h8,10H,5-7H2,1-4H3
charge 0 multiplicity 1
31 atoms
O  -0.013938 -0.011237 0.530865
C  -1.377641 -0.31419 0.015292
C  -2.312129 0.668665 0.742152
C  -1.718685 -1.800205 0.27401
C  2.367921 0.078521 0.521575
C  1.116295 -0.364301 -0.231958
C  -2.09069 2.139304 0.334058
C  -2.939414 -2.288639 -0.537773
C  3.675135 -0.492396 -0.066626
C  2.428934 1.629581 0.606499
C  1.085264 -0.982837 -1.446195
H  -1.392462 -0.105438 -1.076904
H  -2.151104 0.547685 1.831144
H  -3.358938 0.372049 0.535166
H  -0.837059 -2.416461 0.017767
H  -1.901071 -1.937571 1.357587
H  2.25137 -0.306147 1.556367
H  -2.751438 2.816211 0.905501
H  -1.044725 2.437626 0.523034
H  -2.299132 2.291117 -0.741956
H  -3.142785 -3.355645 -0.335821
H  -3.854976 -1.722016 -0.286945
H  -2.764276 -2.181221 -1.625454
H  3.858461 -0.103059 -1.08554
H  3.652353 -1.595864 -0.11588
H  4.532109 -0.192788 0.563598
H  3.283552 1.947781 1.231826
H  2.556682 2.066768 -0.40141
H  1.502316 2.0340 1.047827
H  0.160348 -1.282397 -1.945765
H  2.017725 -1.204896 -1.96774
