program: Gaussian 09
title: 000143418
version: EM64L-G09RevD.01
frameworkgroup: C1[X(C9H18O)]
method: RPBEPBE
basis: SDD
operation: Freq
keyword: #pfreq=noraman
keyword: PBEPBE/SDD
title: #p freq=noraman PBEPBE/SDD
converged: YES YES NO NO
title: Mulliken charges:
elementType: O C C C C C C C C C H H H H H H H H H H H H H H H H H H
charge: -0.290952 -0.088290 -0.279396 -0.208936 0.529347 -0.690747 -0.698806 -0.696304 -0.697826 -0.766398 0.214870 0.207558 0.195989 0.207877 0.210584 0.198019 0.241414 0.221528 0.213388 0.205478 0.226707 0.220074 0.210938 0.209994 0.230606 0.219406 0.233296 0.220582
chargesum: 0.00000
title: Mulliken charges with hydrogens summed into heavy atoms:
elementType: O C C C C C C C C C
charge: -0.290952 0.126580 0.124152 -0.001059 0.529347 -0.040730 -0.058412 -0.038585 -0.037820 -0.312520
polarizability: 1.15537442e+02 -8.15429966e-01 1.06025893e+02 1.65420366e+00 -4.91808194e+00 8.50128808e+01
1716.lowfreq: -11.0399 -8.6409 0.0002 0.0003 0.0005 12.8190 42.0491 55.7238 85.3305
frequency: 41.6217 55.6111 85.3292 98.7416 144.5638 199.0370 201.5671 203.0053 236.6165 244.9437 254.3554 272.5785 324.1477 362.3494 421.2964 432.4371 481.6884 579.3868 642.9820 694.0160 760.5088 829.9368 844.5462 879.0055 915.2701 920.4432 922.4428 929.8737 953.0529 955.8921 970.7790 1009.2570 1078.1377 1113.9707 1138.8862 1150.9545 1168.6759 1190.5152 1231.4914 1273.9543 1299.6341 1301.2071 1305.2510 1343.2167 1366.4279 1371.2320 1377.1843 1390.1330 1398.5530 1425.2998 1463.4124 1464.7497 1469.1331 1472.6965 1476.4274 1479.1835 1482.3336 1489.6456 1493.7716 1637.6885 2940.3840 2970.7063 2974.5682 2979.9394 2982.4515 2986.1062 3007.1581 3008.4343 3061.4864 3068.8941 3074.3767 3077.0554 3078.6562 3086.7734 3090.8802 3094.0951 3125.5848 3226.6253
redmass: 2.4892 2.9028 3.5578 3.1189 2.4095 1.0870 1.2630 1.4402 1.1117 1.3423 2.8075 2.7146 2.3694 2.3596 2.3374 2.2820 2.5844 2.7727 2.7985 1.2250 2.8879 2.4432 1.3887 2.8110 1.4744 1.1776 1.2331 1.7059 1.4843 1.4731 1.7668 2.7039 1.7867 2.4556 1.9662 1.7587 1.9686 1.7633 1.2750 2.4482 1.5219 1.3462 1.3314 1.4399 1.5347 1.1987 1.2148 1.2163 1.2415 1.1839 1.0465 1.0585 1.0459 1.0497 1.0506 1.0708 1.0495 1.0564 1.0628 5.4726 1.0554 1.0359 1.0381 1.0347 1.0355 1.0862 1.0844 1.1029 1.0992 1.0988 1.1004 1.0989 1.0996 1.1005 1.0991 1.0995 1.0617 1.1139
irintensity: 0.0269 0.3902 0.4241 0.2202 3.4903 0.0735 0.6049 0.1802 0.2592 0.1031 1.3608 3.4007 0.7396 0.1919 2.8770 0.8591 0.9250 0.3317 4.1611 0.2255 2.0361 5.4773 94.3637 22.6990 1.6183 7.5095 3.8218 2.2001 1.1345 0.0120 5.6099 68.2145 142.0513 3.3669 3.0622 1.1016 3.2454 4.9451 2.8606 108.4651 9.3792 0.6894 4.7999 0.4642 4.2510 14.6255 20.0523 20.2583 11.5825 4.5092 4.5814 4.3307 0.7746 0.9011 3.2473 13.1371 12.5987 37.8189 14.5816 124.8011 28.1490 36.6150 28.3076 36.2107 28.7534 6.8023 17.3901 45.4181 17.6871 68.6534 20.5859 46.8051 66.8142 9.3692 34.1683 60.2531 1.7763 18.5333
temp: 298.150 k
press: 1.00000 atm
elementType: 8 6 6 6 6 6 6 6 6 6 1 1 1 1 1 1 1 1 1 1 1 1 1 1 1 1 1 1
symmnumber: 1
zpe: 655285.8 jmol-1
zpe.correction: 0.249585 hartree
zpe.thermalcorrener: 0.262774 hartree
zpe.thermalcorrenthalpy: 0.263718 hartree
zpe.thermalcorrgfe: 0.210214 hartree
zpe.sumelectzpe: -428.120611 hartree
zpe.sumelectthermal: -428.107422 hartree
zpe.sumelectthermalent: -428.106478 hartree
zpe.sumelectthermalfe: -428.159982 hartree
dipole: 0.8611 0.2678 0.0068
dipole: 0.9018
quadrupole: -59.3771 -64.6673 -65.8199
quadrupole: 1.2111 0.3775 -0.5870
quadrupole: 3.9110 -1.3792 -2.5318 1.2111 0.3775 -0.5870
hfenergy: -428.3701964 hartree
pointgroup: C01 [X(C9H18O1)]
dipole: -0.3322113 0.1243439 -0.0076891 debye
polarizability: 115.5154873|0.1600025|105.8663653|2.5047103|5.0281742|85.1943626 unknown
InChI: InChI=1S/C9H18O/c1-7(2)6-10-9(5)8(3)4/h7-8H,5-6H2,1-4H3
charge 0 multiplicity 1
28 atoms
O  0.029877 -0.035581 -0.019495
C  -2.377568 -0.244857 -0.308189
C  -1.240754 0.6966 0.120096
C  2.417904 -0.28663 0.142875
C  1.215591 0.628131 0.3382
C  -2.46033 -1.482507 0.613473
C  -3.714135 0.533904 -0.331422
C  2.333091 -1.528648 1.069621
C  2.564153 -0.712876 -1.341806
C  1.28256 1.910918 0.793783
H  -2.148656 -0.587772 -1.337366
H  -1.210341 1.602738 -0.52078
H  -1.36668 1.014755 1.17756
H  3.310618 0.302639 0.428141
H  -3.240983 -2.182387 0.262869
H  -2.713919 -1.182938 1.649238
H  -1.495991 -2.018423 0.637589
H  -4.540535 -0.126737 -0.649915
H  -3.677439 1.391712 -1.029071
H  -3.964805 0.921024 0.675275
H  1.443918 -2.134338 0.820522
H  2.261271 -1.231165 2.131426
H  3.230881 -2.162171 0.94627
H  3.458415 -1.35003 -1.47263
H  1.677643 -1.285467 -1.665941
H  2.66596 0.167315 -2.002166
H  0.406246 2.551192 0.925337
H  2.254408 2.3419 1.045908
