program: Gaussian 09
title: 000143417
version: EM64L-G09RevD.01
frameworkgroup: C1[X(C7H13ClO)]
method: RPBEPBE
basis: SDD
operation: Freq
keyword: #p
keyword: freq=noraman
keyword: PBEPBE/SDD
title: #p freq=noraman PBEPBE/SDD
converged: YES YES NO NO
title: Mulliken charges:
elementType: Cl O C C C C C C C H H H H H H H H H H H H H
charge: -0.056537 -0.273579 -0.202537 0.515685 -0.693483 -0.697572 -0.200178 -0.755462 -0.603999 0.209271 0.239698 0.219493 0.209533 0.213177 0.231425 0.217927 0.211124 0.234352 0.227227 0.225323 0.253619 0.275493
chargesum: 0.00000
title: Mulliken charges with hydrogens summed into heavy atoms:
elementType: Cl O C C C C C C C
charge: -0.056537 -0.273579 0.006734 0.515685 -0.024759 -0.035043 0.245297 -0.302912 -0.074887
polarizability: 9.28687044e+01 -4.16645682e+00 9.54625189e+01 1.73565676e+00 -1.54746660e+00 7.42318032e+01
1716.lowfreq: -12.5437 -10.2518 -0.0023 -0.0018 -0.0017 10.8004 43.3418 48.8035 85.2746
frequency: 43.1424 48.6270 85.2470 121.9227 156.0906 202.6652 236.1751 245.9896 274.6022 285.7390 325.7626 426.5288 492.9502 561.7799 615.9886 641.7284 696.6412 749.3925 819.8225 848.5813 916.4405 923.3750 943.3322 955.3764 966.2015 1011.8681 1069.7923 1096.3025 1113.9916 1168.7033 1173.7463 1224.2651 1274.5833 1298.6885 1300.9139 1306.6536 1372.3752 1374.3122 1395.5118 1427.0261 1435.7582 1461.3227 1463.3086 1473.3741 1477.5216 1493.5756 1641.3605 2937.9894 2982.0476 2984.7947 3007.8261 3016.0991 3063.6761 3076.1095 3080.8485 3090.8402 3097.6070 3125.0447 3146.4433 3226.7152
redmass: 3.8562 4.7602 3.5343 3.9462 3.1417 1.0424 1.1750 2.7823 2.8835 2.1937 2.3636 2.7603 2.7175 2.6436 4.2716 2.9226 1.2463 2.7547 2.0248 1.3810 2.2300 1.1804 2.0763 1.4649 1.9102 1.7723 1.5018 2.8975 2.4682 1.8599 1.2105 1.1881 2.9052 1.3390 1.2333 1.3247 1.3305 1.3109 1.2335 1.1791 1.1101 1.0803 1.0440 1.0501 1.0454 1.0624 5.5065 1.0612 1.0349 1.0357 1.0843 1.0987 1.0581 1.1005 1.0997 1.1005 1.0996 1.0624 1.1101 1.1138
irintensity: 2.0629 1.2476 0.5361 5.0541 0.5784 0.0079 0.6568 0.1665 1.1122 3.2830 0.4661 12.7455 1.8427 0.8309 19.2733 7.2108 0.5173 3.8042 2.7235 103.7925 11.4767 7.3206 10.0932 0.0679 35.1863 14.0968 49.7741 91.6436 3.2141 2.4242 1.3329 0.5435 127.1506 0.0398 18.1951 5.1650 10.0921 8.6098 9.9090 5.2453 12.1427 12.4150 3.7736 1.9945 16.3244 22.8907 118.9158 36.5689 35.8645 26.6882 18.0811 20.1198 23.9467 20.6310 56.6217 8.6112 51.3678 2.4785 9.6733 17.2341
temp: 298.150 k
press: 1.00000 atm
elementType: 17 8 6 6 6 6 6 6 6 1 1 1 1 1 1 1 1 1 1 1 1 1
symmnumber: 1
zpe: 487329.3 jmol-1
zpe.correction: 0.185614 hartree
zpe.thermalcorrener: 0.196900 hartree
zpe.thermalcorrenthalpy: 0.197845 hartree
zpe.thermalcorrgfe: 0.147575 hartree
zpe.sumelectzpe: -809.059880 hartree
zpe.sumelectthermal: -809.048594 hartree
zpe.sumelectthermalent: -809.047649 hartree
zpe.sumelectthermalfe: -809.097919 hartree
dipole: -0.3349 2.2195 0.9765
dipole: 2.4478
quadrupole: -62.4377 -61.3334 -63.1790
quadrupole: 7.0854 3.7502 0.1877
quadrupole: -0.1210 0.9833 -0.8623 7.0854 3.7502 0.1877
hfenergy: -809.245494 hartree
pointgroup: C01 [X(C7H13Cl1O1)]
dipole: 0.0618084 0.7964462 -0.5378937 debye
dipolederiv: -0.272607 -0.0861338 0.0470231 -0.1425394 -0.3438301 0.1295945 0.1109621 0.174602 -0.3157786 -1.476846 -0.2249906 -0.1564751 0.0382816 -0.4762124 -0.0523552 -0.1571948 -0.1098315 -0.2771307 0.0764687 -0.0265685 -0.0136943 0.0465432 0.0430146 -0.0038749 0.0040382 -0.00596 0.1285302 1.1253515 0.2087089 0.1521244 0.3201758 0.7031257 0.1753205 0.2422854 0.1842338 0.0389162 0.035673 0.0343817 0.0203548 -0.0182359 -0.0173922 0.0475551 0.0521083 0.0150519 -0.0111616 0.0507582 0.0415372 0.019921 0.0167231 0.0127721 -0.0435841 -0.0349313 -0.0029985 -0.0408513 0.7349939 -0.0433314 0.0011803 -0.4402424 0.1491015 -0.0171867 0.0076311 0.0232427 0.2578067 -0.1868053 -0.0270139 0.057677 -0.260958 -0.5173215 -0.0172892 -0.0131583 -0.0023758 -0.5203339 0.2027416 0.1174757 -0.1168947 0.164183 0.4480516 -0.2521573 -0.1692993 -0.2516091 0.3998254 -0.1208757 -0.0745832 -0.031306 -0.1006238 -0.0165805 -0.0269865 -0.0414739 -0.0219437 0.0241595 -0.0573398 -0.1094696 -0.0146287 -0.0809267 0.0657992 0.0065794 -0.049052 -0.024442 0.0709039 0.0981311 -0.0121749 0.0085345 -0.0200328 0.0542771 -0.0932487 0.005037 -0.0479262 -0.1575895 -0.0499025 0.1485081 0.0058369 0.1402523 -0.0958202 0.0172904 0.0259652 0.0015511 0.0868014 -0.0501412 0.1468253 0.0273048 0.1551911 -0.0702992 -0.0479307 0.0029333 -0.0270907 0.0638192 -0.0678151 -0.1048219 -0.0745001 -0.0846411 0.0622933 -0.0311535 -0.0248369 -0.0074366 0.0655787 0.0875193 -0.0380063 0.0373342 -0.0588014 -0.0283944 0.1443568 0.035249 0.0971854 -0.0712564 -0.0549499 -0.0755232 0.0519398 0.0985896 -0.0651087 0.121601 -0.0282908 0.1008217 -0.0205937 -0.0105955 -0.0104907 -0.0295634 0.1120999 0.0300985 -0.0586157 0.0345931 -0.0905793 -0.0796444 -0.0265137 0.1242275 -0.0107047 0.1178284 0.003729 -0.0408889 -0.0095538 -0.0343424 0.2203838 -0.0851431 -0.0386355 -0.0428475 -0.0160268 0.1016276 -0.0208032 -0.0443371 -0.024683 0.1762987 -0.0630968 0.0522277 0.0039672 0.0717797 -0.0381642 0.0789464 0.0246751 0.0625973 0.0507571 0.1109943 -0.0021486 0.0574167 -0.0586193 -0.0047668 -0.0151695 0.0266502 -0.0080671 -0.0894406 unknown
polarizability: 92.8324635|4.0860391|95.3378726|-1.5850296|-2.6189435|74.3926903 unknown
InChI: InChI=1S/C7H13ClO/c1-6(2)7(3)9-5-4-8/h6H,3-5H2,1-2H3
charge 0 multiplicity 1
22 atoms
Cl -3.188073 -0.925403 1.175506
O  -0.395445 0.162477 -0.030106
C  1.918656 -0.458637 0.167751
C  0.890483 0.658954 0.263747
C  1.631478 -1.566104 1.216925
C  1.973715 -1.052861 -1.264958
C  -1.525126 1.081062 0.097359
C  1.162592 1.952482 0.591552
C  -2.794076 0.303208 -0.198869
H  2.900882 -0.001951 0.396038
H  0.64176 -2.02035 1.036679
H  1.638742 -1.156296 2.242968
H  2.39866 -2.359589 1.154261
H  2.747837 -1.840025 -1.322156
H  1.001576 -1.502543 -1.532067
H  2.213565 -0.275972 -2.013457
H  -1.425425 1.905147 -0.644325
H  -1.551135 1.524471 1.112781
H  0.401481 2.734871 0.657869
H  2.192666 2.245791 0.806462
H  -3.665191 0.973654 -0.254229
H  -2.69772 -0.294387 -1.11683
