program: Gaussian 09
title: 000143391
version: EM64L-G09RevD.01
frameworkgroup: C1[X(C3H4ClN3)]
method: RPBEPBE
basis: SDD
operation: Freq
keyword: #p
keyword: freq=noraman
keyword: PBEPBE/SDD
title: #p freq=noraman PBEPBE/SDD
converged: NO NO NO NO
title: Mulliken charges:
elementType: Cl N N N C C C H H H H
charge: 0.035104 -0.096930 -0.059776 -0.102058 -0.596166 -0.052457 -0.162692 0.238797 0.261507 0.261501 0.273170
chargesum: 0.00000
title: Mulliken charges with hydrogens summed into heavy atoms:
elementType: Cl N N N C C C
charge: 0.035104 -0.096930 -0.059776 -0.102058 0.165638 -0.052457 0.110478
polarizability: 7.80056447e+01 1.75053110e+00 6.10240984e+01 -4.73703992e-03 3.37176778e-03 3.01073356e+01
1716.lowfreq: -0.0034 -0.0010 -0.0007 6.1988 15.5109 22.3216 59.0898 189.5677 207.4276
frequency: 58.8738 189.5557 207.4268 245.5465 386.9909 466.1732 637.4895 640.0870 666.9348 772.8721 895.5104 934.8993 1043.3851 1116.7516 1124.8416 1162.0478 1282.0979 1315.1275 1340.2746 1407.1101 1466.8960 1471.4491 1487.6077 3006.6723 3099.5210 3123.5483 3247.6243
redmass: 1.0378 4.2576 4.5369 6.0513 5.4412 8.1493 3.7934 10.1347 5.5087 1.4370 8.7017 8.7701 1.7580 4.8655 1.3222 1.6176 6.6076 8.4713 4.5884 2.1074 1.0391 1.6636 1.0691 1.0337 1.1028 1.1016 1.0999
irintensity: 0.0001 0.7237 2.1233 0.4722 0.1216 5.9914 13.0341 0.8613 4.7688 24.3480 5.5331 1.0159 13.7722 31.9510 0.8792 23.4495 13.4684 27.5439 62.9271 25.3367 18.5531 47.3995 27.1470 23.9003 12.6965 7.5901 0.0301
temp: 298.150 k
press: 1.00000 atm
elementType: 17 7 7 7 6 6 6 1 1 1 1
symmnumber: 1
zpe: 196171.5 jmol-1
zpe.correction: 0.074718 hartree
zpe.thermalcorrener: 0.081306 hartree
zpe.thermalcorrenthalpy: 0.082250 hartree
zpe.thermalcorrgfe: 0.043093 hartree
zpe.sumelectzpe: -740.461728 hartree
zpe.sumelectthermal: -740.455139 hartree
zpe.sumelectthermalent: -740.454195 hartree
zpe.sumelectthermalfe: -740.493353 hartree
dipole: 0.3284 6.5809 0.0005
dipole: 6.5891
quadrupole: -48.1656 -49.5535 -47.8204
quadrupole: -6.4419 -0.0002 0.0005
quadrupole: 0.3475 -1.0403 0.6928 -6.4419 -0.0002 0.0005
hfenergy: -740.5364453 hartree
pointgroup: C01 [X(C3H4Cl1N3)]
dipole: -1.1953193 -2.3003216 0.0001884 debye
dipolederiv: -0.6099673 0.2202482 -0.0000664 0.1189743 -0.1278169 0.0000269 -0.0001566 0.0000653 0.0056916 -0.506965 -0.2424895 -0.0000148 -0.2545981 -0.518367 0.0000862 -0.0001124 -0.0000597 -0.0597834 -0.508019 0.0567197 -0.0000565 -0.0996099 -0.2258182 -0.0000642 -0.0000422 0.0000337 -0.1909865 -0.1935394 -0.1245175 0.0000429 0.0011829 -0.2860628 0.0000203 0.0000348 -0.0000111 -0.2381318 0.2448408 0.1709039 -0.0000742 0.147421 0.3398892 -0.000073 -0.0000281 0.0000043 0.2237257 1.0826427 -0.3529463 0.0001418 0.0214773 0.622113 -0.0000628 0.0002628 -0.0001285 0.0266223 0.3208681 0.2874299 -0.0000047 0.0225386 0.1151123 0.0000232 -0.000011 0.0000386 -0.0513968 0.0222071 0.1148578 0.0001031 0.0285628 -0.0443119 -0.0000698 0.0000635 -0.0000792 0.1325934 0.0164251 -0.0706965 0.075909 -0.0166049 0.0621021 -0.0476693 0.0972093 0.0124512 -0.0256226 0.0163018 -0.0706451 -0.0759678 -0.0164704 0.0621694 0.0477712 -0.0972188 -0.0123219 -0.0253939 0.115205 0.0111354 -0.0000123 0.0471264 0.0009907 0.0000113 -0.0000011 0.0000074 0.202682 unknown
polarizability: 76.3878996|-5.2838502|62.6418435|0.0029034|-0.0050377|30.1073356 unknown
InChI: InChI=1S/C3H4ClN3/c1-7-2-5-6-3(7)4/h2H,1H3
charge 0 multiplicity 1
11 atoms
Cl -2.078446 1.205883 -0.00028
N  -0.125774 -0.768551 0.000088
N  0.709921 1.348199 -0.000151
N  1.800512 0.422282 0.000152
C  -1.084705 -1.881226 0.000249
C  -0.406248 0.598507 0.000011
C  1.267121 -0.820281 0.000165
H  -0.52791 -2.831106 -0.000312
H  -1.724343 -1.840943 0.897938
H  -1.725215 -1.840407 -0.896784
H  1.837586 -1.745357 0.000224
