program: Gaussian 09
title: 000143380
version: EM64L-G09RevD.01
frameworkgroup: C1[X(C12H12)]
method: RPBEPBE
basis: SDD
operation: Freq
keyword: #p
keyword: freq=noraman
keyword: PBEPBE/SDD
title: #p freq=noraman PBEPBE/SDD
converged: NO NO NO NO
title: Mulliken charges:
elementType: C C C C C C C C C C C C H H H H H H H H H H H H
charge: 0.226272 0.428763 0.346405 -0.545927 0.534993 -0.456401 -0.428368 -0.484572 -0.459579 -0.272158 -0.821652 -0.822703 0.200213 0.246365 0.225574 0.246764 0.205638 0.232591 0.229164 0.238384 0.238392 0.223850 0.233996 0.233996
chargesum: 0.00000
title: Mulliken charges with hydrogens summed into heavy atoms:
elementType: C C C C C C C C C C C C
charge: 0.226272 0.428763 0.346405 -0.345714 0.534993 -0.210036 -0.202794 -0.237807 -0.253940 -0.039567 -0.115712 -0.130861
polarizability: 2.16939154e+02 -2.17999036e+00 1.47521931e+02 9.32625053e-03 6.08644876e-03 6.03613699e+01
1716.lowfreq: -11.8687 -10.8496 -0.0006 -0.0003 0.0003 6.8590 51.9564 94.1388 120.8129
frequency: 51.8488 94.1294 120.7555 158.8905 186.4925 258.0803 284.8890 300.1471 343.9423 402.9787 406.0834 514.4337 537.7126 554.5346 589.2098 644.0609 706.4207 726.9865 742.5598 772.7757 819.3631 828.3239 852.1511 893.3612 916.7868 925.5149 942.4085 988.4366 1016.1921 1039.2716 1045.3696 1046.0117 1066.2201 1079.0715 1139.9643 1199.8098 1209.8312 1281.6547 1286.1915 1323.5746 1379.5037 1390.0383 1391.8709 1399.4621 1410.9431 1443.9083 1463.6199 1466.5663 1473.5517 1481.6927 1526.9299 1561.5772 1583.2871 1619.3018 2973.0629 2977.8239 3049.2226 3054.7447 3079.1468 3081.4122 3091.3606 3096.4339 3113.1643 3162.0567 3184.4064 3202.8260
redmass: 1.0648 2.9553 1.0950 3.6328 2.6773 3.8400 2.8364 3.0998 5.7958 4.2480 2.8086 3.3296 4.5004 3.9938 2.7909 2.6858 4.6181 5.2697 2.5810 1.1969 1.4856 4.8583 1.4589 1.3361 3.7437 1.3744 2.2038 1.4199 1.6934 1.5618 1.3699 1.5962 1.3834 1.9497 3.1069 2.0563 1.8104 2.4515 1.8336 3.2264 2.8062 1.2668 1.2299 1.5216 2.0474 2.7603 1.0473 1.0464 1.1069 1.1913 5.4783 3.5855 5.4283 8.0062 1.0376 1.0374 1.0972 1.0968 1.0888 1.0863 1.0980 1.0972 1.0919 1.0884 1.0971 1.1036
irintensity: 0.8641 0.1288 1.9010 1.2949 4.7588 1.9828 0.1878 0.5608 1.6514 0.2587 6.5475 1.3671 1.9382 0.3296 2.8894 0.0334 0.1587 2.2108 1.7474 58.6781 34.2244 3.1259 42.9473 0.2053 1.1919 0.0389 4.6902 3.9606 0.4885 1.2399 5.3975 21.1798 19.6521 4.7858 1.1928 1.1404 4.0660 1.4666 17.3156 2.6452 21.2381 41.6193 11.8803 3.8009 12.1174 54.3411 19.6840 8.5614 18.9904 5.1835 18.1819 14.3273 47.2514 106.4645 29.7307 22.9996 17.8277 15.6723 3.1151 20.6242 12.5226 33.8060 39.8975 7.0783 17.2322 16.1387
temp: 298.150 k
press: 1.00000 atm
elementType: 6 6 6 6 6 6 6 6 6 6 6 6 1 1 1 1 1 1 1 1 1 1 1 1
symmnumber: 1
zpe: 520102.5 jmol-1
zpe.correction: 0.198097 hartree
zpe.thermalcorrener: 0.208822 hartree
zpe.thermalcorrenthalpy: 0.209766 hartree
zpe.thermalcorrgfe: 0.161674 hartree
zpe.sumelectzpe: -463.602756 hartree
zpe.sumelectthermal: -463.592030 hartree
zpe.sumelectthermalent: -463.591086 hartree
zpe.sumelectthermalfe: -463.639178 hartree
dipole: -1.8187 0.5822 -0.0002
dipole: 1.9096
quadrupole: -63.5859 -62.0266 -76.9236
quadrupole: 0.8399 0.0004 0.0009
quadrupole: 3.9261 5.4855 -9.4116 0.8399 0.0004 0.0009
hfenergy: -463.8008525 hartree
pointgroup: C01 [X(C12H12)]
dipole: -0.7262284 -0.1924898 0.0000711 debye
dipolederiv: -0.0836969 -0.1500667 0.0000026 -0.7850349 -0.2723369 0.0000518 -0.0000902 -0.0000174 -0.031757 -0.116395 0.0733549 0.000005 0.7810167 -0.0776229 -0.0000851 0.0001207 0.0000057 0.0421737 0.5241636 -0.2243551 -0.0000472 0.0883262 0.4969247 0.0000305 -0.0000235 0.0000515 0.0409925 -0.3877358 0.3440174 0.0000579 0.2733807 -0.2598035 -0.0000048 0.0000658 -0.0000022 -0.2226961 0.5849018 -0.014477 -0.0000329 0.094212 0.3188414 0.0000303 -0.0000592 0.0000275 0.0369844 -0.3950348 -0.0365861 0.0000174 0.0051403 -0.0227122 -0.0000191 0.0000679 -0.0000426 -0.2715467 0.5861781 0.1971996 -0.0000223 -0.0560462 0.2110687 0.000037 -0.0000418 -0.0000293 -0.0814771 -0.263673 0.0241077 0.0000021 -0.019548 0.0037901 -0.0000001 -0.0000302 0.000022 -0.2845567 -0.4765628 -0.25769 -0.0000215 -0.3240065 -0.1461424 0.0000252 -0.0000074 0.0000396 -0.2063281 0.1833784 0.0006848 -0.0000109 0.0673757 0.0859338 0.0000051 -0.000026 0.0000191 -0.1530621 0.0877618 0.1365093 0.0000083 0.0325687 -0.1934392 -0.0000141 -0.0000044 -0.0000039 0.0467561 -0.2369671 -0.002825 0.0000166 -0.1334031 0.079968 0.0000107 -0.0000079 0.0000046 0.0498817 -0.0260036 -0.1044072 -0.0000122 -0.1281315 -0.0539891 -0.0000212 -0.0000182 -0.0000243 0.1293435 0.0796172 0.0307281 -0.0000025 0.083079 -0.0819504 0.0000058 -0.0000217 0.0000243 0.1796683 0.0560987 -0.0617653 0.0000032 -0.0316797 -0.1182022 -0.0000168 0.0000002 0.000004 0.1322876 0.0721197 -0.0230019 0.000011 -0.0921441 -0.0844645 0.0000063 -0.0000085 -0.0000148 0.1934513 -0.0305166 0.1174299 0.0000264 0.1139326 -0.0579407 -0.0000343 0.0000308 -0.0000378 0.1477089 -0.1395531 -0.0019413 0.0000065 0.0069248 0.10917 0.0000048 0.0000339 -0.0000032 0.1729443 -0.0808384 -0.1743156 -0.0000184 -0.0473065 0.016624 -0.0000128 -0.0000048 -0.0000148 0.1040955 0.0215777 0.0624306 -0.1086532 -0.0066816 0.0370642 0.0173469 -0.0746107 0.0731069 -0.0297615 0.0215711 0.0624053 0.1086688 -0.0067031 0.0370908 -0.0173324 0.0746072 -0.0731057 -0.0297499 0.0418869 0.0258459 0.0000116 0.1536867 -0.1159088 -0.0000561 0.0000416 -0.0000454 0.1068041 -0.011124 -0.0116398 0.0416763 -0.0344867 0.0439777 0.1055276 0.1066584 0.0821597 -0.0360485 -0.0111537 -0.0116425 -0.0416925 -0.0344717 0.0440594 -0.1054853 -0.1066722 -0.0821237 -0.0361083 unknown
polarizability: 216.9815227|-1.3451457|147.4795623|-0.0090058|0.0065513|60.3613699 unknown
InChI: InChI=1S/C12H12/c1-9-6-7-11-4-3-5-12(11)10(2)8-9/h3-8H,1-2H3
charge 0 multiplicity 1
24 atoms
C  0.908745 -0.526754 -0.000269
C  0.928749 0.979014 -0.000119
C  -0.235402 -1.371488 -0.000236
C  -1.59223 -0.96054 -0.000182
C  -2.19849 0.329054 -0.000006
C  2.267233 -0.946822 -0.000272
C  -0.159642 1.867172 0.000074
C  2.302689 1.377158 -0.000285
C  -1.545654 1.587238 0.000138
C  3.106816 0.211336 -0.00026
C  0.020235 -2.876065 -0.000416
C  -3.726539 0.336859 0.000138
H  -2.315223 -1.790361 -0.000289
H  2.61961 -1.979189 -0.000214
H  0.109246 2.934513 0.000113
H  2.649143 2.413076 -0.000315
H  -2.207074 2.464319 0.000294
H  4.200168 0.191013 -0.000279
H  -0.921198 -3.448904 -0.000486
H  0.60804 -3.176063 0.887752
H  0.608109 -3.175915 -0.888589
H  -4.131676 1.362203 0.00039
H  -4.125408 -0.188765 0.888942
H  -4.125546 -0.188387 -0.888822
