program: Gaussian 09
title: 000143368
version: EM64L-G09RevD.01
frameworkgroup: C1[X(C12H13NO2)]
method: RPBEPBE
basis: SDD
operation: Freq
keyword: #p
keyword: freq=noraman
keyword: PBEPBE/SDD
title: #p freq=noraman PBEPBE/SDD
converged: NO YES NO NO
title: Mulliken charges:
elementType: O O N C C C C C C C C C C C C H H H H H H H H H H H H H
charge: -0.274681 -0.273082 -0.227428 0.246607 0.308897 0.219632 -0.473583 -0.355013 -0.618245 -0.414234 0.166491 -0.225093 -0.247680 -0.216298 -0.674536 0.283744 0.230239 0.255662 0.255691 0.216616 0.241933 0.223326 0.224284 0.227393 0.227366 0.210981 0.230504 0.230510
chargesum: 0.00000
title: Mulliken charges with hydrogens summed into heavy atoms:
elementType: O O N C C C C C C C C C C C C
charge: -0.274681 -0.273082 -0.227428 0.246607 0.308897 0.219632 -0.189840 -0.124774 0.109724 -0.172301 0.166491 -0.001767 -0.023396 0.238461 -0.002541
polarizability: 2.40786554e+02 -1.50961097e+01 1.52104251e+02 5.38528321e-02 7.57869384e-03 7.03669369e+01
1716.lowfreq: -7.3008 -1.7286 -0.0007 -0.0003 0.0001 6.1200 24.6071 41.5467 67.7977
frequency: 22.6223 41.2815 67.7822 73.8466 85.7947 125.3228 142.0609 215.1348 243.4139 269.4031 274.1854 292.4609 311.7417 353.3946 400.1160 434.1068 535.2151 569.6030 572.0230 586.1679 591.3079 718.0896 719.3788 745.1308 747.4322 760.2382 800.4044 809.8013 834.6907 852.5528 860.6922 891.2230 939.8005 976.1072 1009.9967 1020.3936 1052.0227 1096.4767 1112.2435 1119.1190 1133.8843 1135.2819 1153.2709 1174.5947 1200.5977 1248.3242 1248.9724 1323.1531 1349.3119 1354.2439 1388.1161 1402.2850 1412.7493 1437.3221 1462.5330 1463.1859 1467.0613 1474.2835 1477.5426 1486.4498 1488.1632 1512.3114 1576.1066 1616.1777 1626.4610 2996.3383 3007.8804 3011.9365 3065.7862 3092.3574 3100.0422 3108.1549 3123.5990 3128.3159 3137.7356 3151.1450 3166.1316 3237.9790
redmass: 1.0610 3.0774 3.3825 3.5202 3.9887 2.8332 3.3456 4.7252 1.2718 3.9426 3.5032 4.9638 4.0972 6.7001 3.9995 2.9521 4.9487 3.6359 4.7684 6.1280 4.7615 4.9399 5.4999 6.6106 1.3295 3.5964 1.1016 3.8457 1.3766 3.8071 1.6340 4.7745 1.3832 1.3110 2.1297 2.2678 4.3772 2.4607 2.2030 1.3093 1.4914 1.4605 1.3396 1.1373 3.6195 1.1348 2.2121 1.9950 2.3281 1.8265 3.5629 1.2940 4.0700 1.8554 1.0395 1.0403 1.8926 1.0686 2.4873 1.1180 1.3166 5.1030 6.3938 10.7877 7.3141 1.0360 1.0580 1.0335 1.1067 1.0984 1.1018 1.1024 1.1012 1.0849 1.0888 1.0955 1.1003 1.0981
irintensity: 0.0977 1.2099 0.1727 2.2381 0.8851 5.4387 0.1131 4.8903 0.0283 4.9159 0.5011 0.6133 8.4199 11.2979 2.1265 13.1423 6.0341 0.0026 3.3056 5.4297 0.1740 12.4737 0.3835 2.6904 80.2387 10.0456 2.0953 5.6604 23.0097 4.4683 17.4134 6.4109 3.9721 0.0790 12.0443 8.5789 365.9787 0.1424 4.1744 0.6490 7.8106 5.4214 143.2947 25.5717 335.6897 0.0010 10.9462 19.1843 17.4959 1.5509 52.9529 22.8616 38.8140 28.6955 11.4993 13.1758 61.5827 4.2038 16.6802 9.8124 1.9679 41.8973 0.0586 394.1275 22.8015 22.9231 25.0545 35.8545 10.4087 32.7756 14.4512 44.6405 13.1010 0.1971 2.6446 33.6111 34.0194 0.2658
temp: 298.150 k
press: 1.00000 atm
elementType: 8 8 7 6 6 6 6 6 6 6 6 6 6 6 6 1 1 1 1 1 1 1 1 1 1 1 1 1
symmnumber: 1
zpe: 587441.6 jmol-1
zpe.correction: 0.223745 hartree
zpe.thermalcorrener: 0.238019 hartree
zpe.thermalcorrenthalpy: 0.238963 hartree
zpe.thermalcorrgfe: 0.180810 hartree
zpe.sumelectzpe: -669.203805 hartree
zpe.sumelectthermal: -669.189530 hartree
zpe.sumelectthermalent: -669.188586 hartree
zpe.sumelectthermalfe: -669.246740 hartree
dipole: -0.1553 -0.1431 0.0013
dipole: 0.2112
quadrupole: -73.3216 -82.0053 -91.5168
quadrupole: 7.4918 0.0022 0.0032
quadrupole: 8.9597 0.2759 -9.2356 7.4918 0.0022 0.0032
hfenergy: -669.4275493 hartree
pointgroup: C01 [X(C12H13N1O2)]
dipole: 0.0594002 -0.0580848 -0.0004947 debye
polarizability: 241.6102564|12.4163695|151.2805489|0.0536019|-0.0091869|70.3669369 unknown
InChI: InChI=1S/C12H13NO2/c1-3-15-12(14)11-8-9-6-4-5-7-10(9)13(11)2/h4-8H,3H2,1-2H3
charge 0 multiplicity 1
28 atoms
O  2.811515 -0.587353 0.001546
O  2.472103 1.726281 0.001194
N  -0.45395 1.154293 0.000774
C  -1.677567 0.478036 0.000212
C  -1.408396 -0.943199 0.000826
C  0.580503 0.187462 0.001817
C  0.016941 -1.0992 0.001705
C  -3.001784 0.981967 -0.00077
C  -0.288126 2.615729 0.000445
C  -2.495911 -1.861585 0.000448
C  1.999762 0.555289 0.002693
C  -4.054339 0.049031 -0.001147
C  -3.806934 -1.360083 -0.000546
C  4.28252 -0.330122 0.000271
C  4.964057 -1.694476 -0.000836
H  0.591202 -2.022531 0.002318
H  -3.215067 2.055734 -0.001251
H  0.270945 2.948073 0.890132
H  0.271691 2.947611 -0.888953
H  -1.283987 3.084709 -0.000096
H  -2.308196 -2.940836 0.000889
H  -5.089201 0.409255 -0.001933
H  -4.657794 -2.049896 -0.000883
H  4.531895 0.269588 -0.894084
H  4.533519 0.268961 0.894589
H  6.061698 -1.5641 -0.001793
H  4.684218 -2.275634 0.894326
H  4.682584 -2.275003 -0.895895
