program: Gaussian 09
title: 000147498
version: EM64L-G09RevD.01
frameworkgroup: C1[X(C20H15NO2)]
method: RPBEPBE
basis: SDD
operation: Freq
keyword: #p
keyword: freq=noraman
keyword: PBEPBE/SDD
title: #p freq=noraman PBEPBE/SDD
converged: NO YES NO NO
title: Mulliken charges:
elementType: O O N C C C C C C C C C C C C C C C C C C C C H H H H H H H H H H H H H H H
charge: -0.218106 -0.227655 0.016312 -0.003643 0.027923 -0.510547 -0.519217 -0.427337 -0.426713 0.390934 0.367888 0.009612 -0.085669 0.300351 0.488789 -0.443228 -0.424340 0.217421 -0.426227 -0.482968 -0.461680 -0.490759 -0.270076 0.225993 0.230696 0.226312 0.229290 0.208071 0.215488 0.208667 0.214766 0.261776 0.256585 0.308130 0.241963 0.249612 0.288561 0.233027
chargesum: 0.00000
title: Mulliken charges with hydrogens summed into heavy atoms:
elementType: O O N C C C C C C C C C C C C C C C C C C C C
charge: -0.218106 -0.227655 0.016312 -0.003643 0.027923 -0.053858 -0.063614 -0.003778 -0.003280 0.390934 0.367888 0.009612 -0.085669 0.300351 0.488789 -0.181452 -0.167755 0.217421 -0.118097 -0.241005 -0.212069 -0.202198 -0.037050
polarizability: 3.73347862e+02 4.19730569e+01 3.18605076e+02 -4.86771168e-01 -1.27163850e+00 1.00793423e+02
1716.lowfreq: -19.7669 -8.3740 -3.8553 -0.0007 -0.0002 0.0004 8.4973 50.2013 59.5012
frequency: -19.7585 50.1893 59.4867 95.5253 120.9780 166.9328 182.6689 198.6459 239.8328 255.1967 274.4022 293.1572 314.3185 332.2484 357.9945 382.2187 404.8928 424.8428 446.1552 480.7857 486.4035 503.9587 535.8538 543.5089 563.5473 565.8091 573.6398 590.0955 596.7270 649.5007 684.2477 700.3628 713.2197 727.6247 738.7514 775.6828 795.1365 812.0685 824.4399 835.0277 850.9330 852.2369 866.0366 896.4217 907.4140 925.5119 940.8075 983.0999 987.2512 994.0233 1011.6919 1013.0133 1038.7855 1069.2506 1082.8674 1100.5528 1112.2929 1138.1818 1167.2152 1169.0478 1173.6490 1187.5197 1188.5941 1205.1722 1213.7805 1245.7730 1254.3319 1271.0101 1278.5912 1307.8522 1315.8777 1337.2319 1342.1516 1346.9341 1361.0838 1362.0847 1381.0710 1404.6604 1411.4381 1430.4490 1433.8228 1452.4852 1455.7796 1465.3508 1474.1864 1476.8800 1491.2433 1504.1819 1555.7823 1586.8589 1595.9111 1601.0113 1627.3717 2956.6910 2956.9815 2981.5949 2983.8771 3018.6447 3020.3492 3046.4629 3053.2944 3130.9431 3133.4695 3149.9156 3169.7447 3170.2276 3191.0396 3216.6843
redmass: 14.8828 5.8080 3.9582 3.1459 3.0814 3.2908 5.6689 3.9908 6.3779 4.2777 3.2421 5.5158 2.3741 6.0903 3.6264 5.6752 5.7646 3.8105 4.6842 4.0226 3.8892 3.0753 6.2071 4.1048 4.3632 5.6286 4.3632 3.8478 5.6587 4.6008 6.6741 3.6217 6.0100 3.6147 7.2656 1.6368 3.2229 2.6801 2.5783 2.0955 7.1843 1.5857 1.7080 2.6004 1.5773 1.5066 2.9082 2.2556 1.5137 1.3652 1.3491 5.5055 4.0869 2.4550 1.8985 2.0595 1.5609 1.1557 1.9438 1.9234 1.6882 1.9395 1.9078 1.5342 2.3470 1.7772 1.2933 1.2332 2.2804 2.9057 1.8007 1.6928 2.9456 1.5972 1.7301 2.2934 7.2276 4.2668 4.5161 2.0925 4.3840 1.1984 1.5427 1.8973 1.2437 1.1148 3.0793 4.7340 4.9284 6.2721 7.5120 6.9445 7.3344 1.0644 1.0647 1.0665 1.0614 1.0924 1.0939 1.0980 1.1040 1.0876 1.0906 1.0923 1.0963 1.0882 1.0955 1.0932
irintensity: 0.0132 1.3305 0.0991 0.0156 0.8026 4.9341 1.4147 5.8533 0.8438 0.0490 0.4394 0.0714 0.2205 0.3927 0.0174 1.8067 0.1353 0.0251 2.8434 1.5738 0.1459 1.7031 1.4952 1.5926 1.5050 1.0947 0.9662 0.7351 2.1154 0.5388 14.8026 6.1289 2.1325 9.2742 14.9327 21.9371 5.9262 2.3637 12.5626 10.4619 9.6762 54.9419 38.4359 2.3007 6.4158 5.7926 0.4437 3.8813 0.7544 3.0756 0.4138 5.2345 7.6014 0.2987 0.0227 3.5646 0.7812 3.6347 273.1492 3.4282 94.2679 192.8507 188.7432 54.3148 81.6077 7.0825 5.5151 16.7925 16.6115 16.6042 0.3512 1.4438 30.3170 11.3403 5.8319 1.5044 0.4303 40.4433 1.7525 4.9230 9.7915 2.3420 9.3950 1.3741 11.1579 10.0063 0.8857 35.7161 3.3011 103.9267 8.9285 19.3307 45.2044 38.2299 0.5520 39.2724 27.3016 46.2031 6.1307 74.5428 51.4981 1.3190 14.4708 20.1754 28.4251 2.9922 4.2048 10.5479
temp: 298.150 k
press: 1.00000 atm
elementType: 8 8 7 6 6 6 6 6 6 6 6 6 6 6 6 6 6 6 6 6 6 6 6 1 1 1 1 1 1 1 1 1 1 1 1 1 1 1
symmnumber: 1
zpe: 779503.2 jmol-1
zpe.correction: 0.296897 hartree
zpe.thermalcorrener: 0.312842 hartree
zpe.thermalcorrenthalpy: 0.313786 hartree
zpe.thermalcorrgfe: 0.254180 hartree
zpe.sumelectzpe: -974.734279 hartree
zpe.sumelectthermal: -974.718335 hartree
zpe.sumelectthermalent: -974.717391 hartree
zpe.sumelectthermalfe: -974.776996 hartree
dipole: 8.0804 0.8389 -0.0588
dipole: 8.1240
quadrupole: -152.2670 -114.6801 -136.0900
quadrupole: -8.2019 0.2659 -0.1772
quadrupole: -17.9213 19.6656 -1.7443 -8.2019 0.2659 -0.1772
hfenergy: -975.0311765 hartree
pointgroup: C01 [X(C20H15N1O2)]
dipole: 3.179912 0.3212249 -0.0292423 debye
polarizability: 373.5765549|41.8168855|318.3664884|-1.048394|-1.8498268|100.8033186 unknown
InChI: InChI=1S/C20H15NO2/c22-21(23)18-11-10-16-14-6-2-1-5-13(14)15-7-3-4-12-8-9-17(18)20(16)19(12)15/h3-4,7-11H,1-2,5-6H2
charge 0 multiplicity 1
38 atoms
O  -4.79533 -2.099882 0.066675
O  -4.857924 0.166662 0.030366
N  -4.196986 -0.948638 0.04137
C  1.581136 -1.377015 -0.022177
C  2.407697 -0.251693 0.022464
C  2.158333 -2.790287 -0.094856
C  3.927333 -0.378977 0.099586
C  3.664477 -2.831614 -0.423264
C  4.417894 -1.80167 0.435634
C  0.130949 -1.223782 -0.007115
C  1.820055 1.084771 0.003253
C  -0.473645 0.088435 -0.001978
C  0.385563 1.242722 -0.01497
C  -1.919215 0.254778 0.004905
C  -0.183253 2.566445 -0.034451
C  -0.727411 -2.360715 0.022114
C  2.630452 2.255391 -0.018082
C  -2.715864 -0.940655 0.028029
C  -2.453455 1.601621 -0.012156
C  -1.615807 2.701147 -0.034083
C  0.66551 3.705782 -0.052064
C  -2.117158 -2.222298 0.042455
C  2.062718 3.546965 -0.0484
H  1.978027 -3.308372 0.870778
H  1.6075 -3.371679 -0.858712
H  4.366653 -0.05699 -0.868289
H  4.315006 0.327299 0.858227
H  3.82066 -2.597345 -1.495199
H  4.053471 -3.852576 -0.253798
H  4.237754 -2.01746 1.507636
H  5.509197 -1.867434 0.270301
H  -0.305272 -3.367506 0.038198
H  3.719719 2.162867 -0.019289
H  -3.534481 1.727113 -0.008567
H  -2.044879 3.709861 -0.049129
H  0.218041 4.705953 -0.068645
H  -2.772913 -3.095265 0.067841
H  2.715647 4.425839 -0.067307
