program: Gaussian 09
title: 000147495
version: EM64L-G09RevD.01
frameworkgroup: C1[X(C15H9NO3)]
method: RPBEPBE
basis: SDD
operation: Freq
keyword: #p
keyword: freq=noraman
keyword: PBEPBE/SDD
title: #p freq=noraman PBEPBE/SDD
converged: NO YES YES YES
title: Mulliken charges:
elementType: O O O N C C C C C C C C C C C C C C C H H H H H H H H H
charge: -0.217703 -0.201933 -0.183658 0.108002 0.223067 0.196669 0.206592 -0.082505 -0.438741 0.161318 -0.043788 0.385315 -0.385902 -0.343341 -0.476369 -0.810290 -0.239298 -0.211782 0.120708 0.267204 0.242036 0.265526 0.259891 0.242918 0.244151 0.242916 0.232192 0.236808
chargesum: 0.00000
title: Mulliken charges with hydrogens summed into heavy atoms:
elementType: O O O N C C C C C C C C C C C C C C C
charge: -0.217703 -0.201933 -0.183658 0.108002 0.223067 0.196669 0.206592 -0.082505 -0.171538 0.161318 -0.043788 0.385315 -0.143866 -0.077816 -0.216478 -0.080305 -0.007106 0.025025 0.120708
polarizability: 3.62334609e+02 8.82088774e+00 1.71822187e+02 -1.54542938e-02 6.32419934e-03 7.13240730e+01
1716.lowfreq: -8.7699 -7.0362 -0.0007 0.0004 0.0008 1.2959 50.0356 72.9766 123.0619
frequency: 50.0292 72.9702 123.0609 134.5592 160.3349 185.4937 204.1370 236.5978 259.2844 276.6867 326.4956 357.7163 365.9398 437.7087 447.2244 449.1902 465.5011 528.1061 543.9147 553.4153 565.0887 584.5955 613.6548 647.2097 662.5055 688.1865 706.0485 751.5533 759.5095 761.7982 773.9826 786.0635 805.6831 858.8008 866.6078 873.8266 920.5519 946.2006 973.9018 985.0285 991.4572 1012.7495 1043.4394 1046.5777 1092.4048 1114.9850 1146.4312 1168.4336 1175.2197 1209.1506 1231.5869 1262.1606 1300.5903 1331.8322 1368.1177 1387.0313 1399.5988 1414.9366 1432.4408 1455.7878 1467.3614 1469.0063 1479.5274 1530.1809 1589.9116 1611.5842 1614.4979 1640.0633 1691.3501 2981.1785 3058.0919 3104.4918 3137.9899 3150.2407 3163.6996 3167.1033 3174.8145 3183.2024
redmass: 7.7719 4.2094 9.1599 5.1908 1.4534 3.8247 1.9979 8.2835 5.1619 5.0956 7.5185 6.3018 5.4006 3.6638 7.1746 3.5442 6.9408 7.5307 6.9300 4.2363 4.2659 5.5417 8.1400 8.8818 4.9354 6.7223 5.9157 3.2461 6.8522 1.6378 7.3346 4.2433 7.9958 7.2049 1.4010 1.3942 1.4917 1.3911 6.3107 1.3187 2.0088 2.0531 4.3588 1.5818 2.4390 3.3775 2.3921 2.2411 1.3652 4.2983 1.6522 2.1266 1.9889 2.1468 5.0736 8.4765 1.2908 4.3777 3.0392 3.5053 1.0451 1.1054 4.2364 9.4594 7.3476 7.6274 7.5065 8.3306 10.6332 1.0384 1.0971 1.0982 1.0865 1.0913 1.0927 1.0965 1.0922 1.0982
irintensity: 0.2133 0.8395 0.2475 0.1790 0.0285 0.8712 1.4612 0.3417 0.6555 0.0334 1.2752 3.9961 0.0833 0.7724 12.0623 8.6608 1.1019 12.6781 0.5696 4.9480 0.7684 14.1430 0.0141 13.3933 0.1884 38.4434 3.6576 22.4052 11.9417 54.3628 2.7034 32.8874 5.7171 72.3510 0.2594 18.2041 26.3781 2.5493 107.3772 0.0738 33.1020 50.5544 35.2621 7.4015 44.7064 59.9687 158.2251 1.0699 59.9438 3.2186 9.4428 31.3591 6.3583 168.3252 46.8581 11.9868 28.1466 75.0776 50.3566 20.8489 17.7583 16.2008 21.3672 39.7143 82.4129 107.3908 19.6310 28.0275 647.2522 10.2184 11.9387 20.4770 0.9253 9.0333 2.0319 22.4596 1.4205 9.5583
temp: 298.150 k
press: 1.00000 atm
elementType: 8 8 8 7 6 6 6 6 6 6 6 6 6 6 6 6 6 6 6 1 1 1 1 1 1 1 1 1
symmnumber: 1
zpe: 529397.7 jmol-1
zpe.correction: 0.201637 hartree
zpe.thermalcorrener: 0.215632 hartree
zpe.thermalcorrenthalpy: 0.216576 hartree
zpe.thermalcorrgfe: 0.160948 hartree
zpe.sumelectzpe: -856.145098 hartree
zpe.sumelectthermal: -856.131104 hartree
zpe.sumelectthermalent: -856.130159 hartree
zpe.sumelectthermalfe: -856.185788 hartree
dipole: 4.9822 7.9679 -0.0002
dipole: 9.3973
quadrupole: -109.9779 -107.9547 -110.8496
quadrupole: -18.7407 0.0012 0.0025
quadrupole: -0.3838 1.6394 -1.2555 -18.7407 0.0012 0.0025
hfenergy: -856.3467354 hartree
pointgroup: C01 [X(C15H9N1O3)]
dipole: 1.981336 3.1214718 -0.0000609 debye
polarizability: 362.4452884|7.5306114|171.711508|-0.0154111|0.0064287|71.324073 unknown
InChI: InChI=1S/C15H9NO3/c1-8-6-13(17)19-14-10(8)7-11-9-4-2-3-5-12(9)18-15(11)16-14/h2-7H,1H3
charge 0 multiplicity 1
28 atoms
O  1.791555 -1.81386 -0.000096
O  -2.884801 -1.423575 0.000102
O  -5.191703 -1.311835 0.000519
N  -0.595479 -1.647891 0.00002
C  0.879698 0.350172 0.000082
C  2.331074 0.481501 0.000011
C  -1.536766 0.643411 0.000198
C  0.600448 -1.058609 -0.000002
C  -0.230216 1.209797 0.000191
C  2.842311 -0.850212 -0.000092
C  -1.646285 -0.793389 0.000113
C  -2.763734 1.438142 0.000351
C  3.243494 1.561929 0.000033
C  4.20549 -1.16249 -0.000177
C  -3.983372 0.792487 0.000316
C  -2.686112 2.948651 0.000594
C  4.626387 1.274883 -0.000045
C  5.100407 -0.065891 -0.000148
C  -4.134267 -0.659128 0.000013
H  -0.104701 2.296214 0.000271
H  2.892095 2.599056 0.00012
H  4.55353 -2.198474 -0.00025
H  -4.921946 1.353326 0.00052
H  -2.146073 3.320951 0.891444
H  -3.692039 3.397184 0.000697
H  -2.146115 3.321258 -0.890155
H  5.348999 2.097418 -0.000024
H  6.17882 -0.255428 -0.000206
