program: Gaussian 09
title: 000147487
version: EM64L-G09RevD.01
frameworkgroup: C1[X(C12H9NO3)]
method: RPBEPBE
basis: SDD
operation: Freq
keyword: #p
keyword: freq=noraman
keyword: PBEPBE/SDD
title: #p freq=noraman PBEPBE/SDD
converged: NO NO NO NO
title: Mulliken charges:
elementType: O O O N C C C C C C C C C C C C H H H H H H H H H
charge: -0.229906 -0.243826 -0.149238 -0.044107 0.153540 0.249430 0.250273 -0.542025 0.279549 0.266060 -0.511968 0.083555 -0.314913 -0.793077 -0.774894 0.014302 0.263664 0.292486 0.278445 0.238671 0.238586 0.238630 0.238769 0.238759 0.279236
chargesum: 0.00000
title: Mulliken charges with hydrogens summed into heavy atoms:
elementType: O O O N C C C C C C C C C C C C
charge: -0.229906 -0.243826 -0.149238 -0.044107 0.153540 0.249430 0.250273 -0.278362 0.279549 0.266060 -0.219482 0.083555 -0.036469 -0.077189 -0.018130 0.014302
polarizability: 2.48915572e+02 -1.39496630e-01 1.50861349e+02 -2.65456492e-02 3.37678701e-03 6.59828728e+01
1716.lowfreq: -9.0679 -4.6522 0.0006 0.0007 0.0011 2.8435 40.9376 95.3874 127.5733
frequency: 40.9125 95.3835 127.5645 143.8255 146.3677 157.3386 201.8825 235.9656 243.9365 302.9851 303.0803 367.0029 389.0863 411.9777 436.8859 501.3755 531.2100 553.8168 557.3388 583.5003 607.9737 659.5422 687.2240 722.2408 729.4662 744.2231 751.0411 774.1292 785.9650 823.8900 868.7781 895.3677 912.0817 979.4138 992.4431 1030.6776 1038.3132 1046.4594 1056.3161 1086.8513 1116.7517 1199.1859 1238.9309 1259.6693 1305.8705 1340.8548 1386.4031 1403.0607 1410.3793 1439.2711 1454.2071 1459.0820 1465.4896 1469.4434 1476.9814 1537.3537 1588.3242 1597.6757 1634.3142 1689.7284 2980.9016 2986.4019 3057.1931 3064.1162 3093.7592 3133.5678 3161.1661 3199.3351 3257.0503
redmass: 5.8269 4.5738 3.3885 1.0931 1.3039 3.5261 3.3600 4.4055 4.1814 6.3215 4.4212 5.2537 8.1339 4.8553 3.1100 6.0289 5.4540 6.2870 3.7020 4.1190 5.6706 6.6606 7.9146 7.7588 8.0599 7.2827 3.7285 7.4178 1.3409 5.0165 1.4871 1.4648 2.9290 2.4167 3.7212 2.9879 1.6420 1.4775 2.7720 2.9960 2.5467 2.2169 1.4871 2.1021 3.5273 5.9640 1.3980 2.6026 1.5591 1.8331 1.9159 3.7547 1.0468 1.0433 1.2722 5.8381 8.7210 5.9138 8.1164 12.8314 1.0377 1.0390 1.0982 1.0966 1.0982 1.0980 1.0921 1.0943 1.1007
irintensity: 0.7633 0.0984 0.2112 0.1329 1.7350 0.1455 0.0001 0.3862 0.9818 3.7769 1.4581 2.4492 3.9603 3.2962 5.3763 7.0149 1.0906 10.0807 0.5360 4.3229 13.6606 1.8332 9.4499 64.0830 8.5164 0.1929 2.5373 1.3856 32.2018 76.5327 29.0742 31.9256 53.3749 30.1526 12.5286 76.1082 2.5513 3.6185 0.7816 1.5827 61.8908 11.9925 5.8736 0.1858 57.4509 115.8649 40.5983 14.1643 7.7408 54.1241 31.5395 12.2715 18.0654 19.4340 38.9121 316.5198 49.5630 6.2858 178.0555 528.8819 28.4017 5.6031 17.6027 10.9718 17.8341 7.1594 2.9563 1.5241 1.0905
temp: 298.150 k
press: 1.00000 atm
elementType: 8 8 8 7 6 6 6 6 6 6 6 6 6 6 6 6 1 1 1 1 1 1 1 1 1
symmnumber: 1
zpe: 478089.4 jmol-1
zpe.correction: 0.182095 hartree
zpe.thermalcorrener: 0.195334 hartree
zpe.thermalcorrenthalpy: 0.196278 hartree
zpe.thermalcorrgfe: 0.142305 hartree
zpe.sumelectzpe: -741.979018 hartree
zpe.sumelectthermal: -741.965779 hartree
zpe.sumelectthermalent: -741.964835 hartree
zpe.sumelectthermalfe: -742.018808 hartree
dipole: 7.8561 4.2816 -0.0030
dipole: 8.9471
quadrupole: -108.9258 -86.6441 -92.6739
quadrupole: -3.8552 0.0110 0.0039
quadrupole: -12.8445 9.4372 3.4073 -3.8552 0.0110 0.0039
hfenergy: -742.1611126 hartree
pointgroup: C01 [X(C12H9N1O3)]
dipole: -3.0662918 -1.7288054 -0.0011989 debye
dipolederiv: -1.0235225 -0.2156246 -0.0001139 0.1524863 -0.5627521 0.0000494 -0.000192 -0.0000371 -0.1316644 -1.5972359 -0.0277934 -0.0004692 0.2344591 -0.4918132 0.0003175 0.0004587 -0.0002804 -0.1767287 -1.4079474 -0.2568273 0.0005081 -0.6102366 -0.5920461 0.0002876 -0.0016639 -0.0004187 -0.3292274 -1.0895885 -0.2466882 0.0000834 -0.6753771 -0.7920573 -0.000167 0.0000046 0.0004945 -0.2461623 0.018703 -0.0391132 -0.0000146 0.4421636 -0.3974717 0.0000509 0.0000151 0.0000371 0.0120933 -0.8717434 0.2142526 -0.0000738 0.3117789 -0.4020297 0.0000849 -0.0004658 0.0001815 0.0325684 0.6449827 0.030472 0.0001131 -0.674654 0.2719389 -0.0000631 0.0001354 0.0000293 0.0633286 0.4926118 -0.1501442 0.0000886 0.0157056 0.0910558 -0.0000425 0.0000295 -0.0000762 -0.1302834 0.1233445 0.2173776 0.0000052 0.1675481 0.114006 -0.0000102 -0.0000742 -0.0000862 -0.079007 0.8955692 0.1906237 0.0002007 0.0513688 0.2350533 -0.0000373 0.0001507 -0.0000765 0.091122 -0.4151597 -0.0650632 -0.00006 0.087591 0.0291462 0.0000025 0.0001271 0.0000483 -0.1650245 1.4200121 -0.0315507 0.0000383 -0.2975592 0.8973202 -0.0001953 0.0004737 0.0000443 0.0829169 0.1094432 0.2139049 0.0000256 0.2414424 0.4298779 0.0000054 0.0000558 -0.0000018 -0.1393991 0.0289791 -0.0267879 0.0000073 -0.0273186 -0.0146479 -0.0000165 0.0000487 0.0001145 0.0824326 -0.0129785 -0.0929967 -0.0000351 0.0551157 -0.3896543 0.0000516 0.0001874 -0.0002953 0.01907 2.3792224 0.2544325 -0.0002751 0.588618 1.2079218 -0.0003865 0.0007612 0.0001352 0.3257718 0.1124241 -0.0187224 0.0000001 -0.0284955 -0.0440282 0.0000077 -0.0000038 0.0000285 0.1453856 0.097232 -0.0142116 -0.0000185 -0.0123125 0.0437723 0.0000056 -0.0000068 0.0000118 0.1953102 0.0161725 0.0035948 -0.0000355 0.0027684 0.0961161 0. -0.0000467 0.0000095 0.2132677 -0.1536682 -0.0262556 -0.0002491 0.0620682 0.0703248 0.0000873 -0.0002635 -0.0000258 0.1192581 0.085139 0.0284881 0.0749134 -0.0341272 -0.0094443 -0.0807853 0.0218714 -0.1124617 -0.0361746 0.0853268 0.0281204 -0.0746433 -0.0343893 -0.0093805 0.0807647 -0.0215936 0.1124784 -0.0365391 0.0537291 -0.038541 -0.1060633 -0.0185918 0.0630227 -0.0210093 -0.0879587 -0.04738 -0.0177886 0.05365 -0.038563 0.1061097 -0.018656 0.0630698 0.0209876 0.0879748 0.0474819 -0.0178236 -0.0446973 0.1076164 -0.0000423 0.0186038 0.0926996 0.0000102 -0.0000252 0.0000449 0.1232976 unknown
polarizability: 248.8993039|1.2705587|150.8776167|0.0265915|-0.0029947|65.9828728 unknown
InChI: InChI=1S/C12H9NO3/c1-6-5-15-10-4-11-9(3-8(6)10)7(2)13-12(14)16-11/h3-5H,1-2H3
charge 0 multiplicity 1
25 atoms
O  -2.787183 1.796542 -0.000306
O  2.07379 1.445303 0.000414
O  4.36583 1.19374 0.001316
N  3.111387 -0.801693 0.000462
C  -1.761123 -0.286593 -0.000106
C  0.659886 -0.565055 0.000239
C  -1.552339 1.131763 -0.000093
C  -0.642142 -1.136877 0.000053
C  -3.209859 -0.495798 -0.000273
C  0.804151 0.866356 0.000266
C  -0.297812 1.745002 0.000127
C  1.893045 -1.351561 0.000576
C  -3.772972 0.760281 -0.000421
C  -3.922875 -1.81982 -0.000356
C  1.844142 -2.860804 0.000803
C  3.284316 0.594381 -0.000496
H  -0.76231 -2.22422 0.000101
H  -0.153585 2.826595 0.000145
H  -4.8004 1.114289 -0.00061
H  -5.017808 -1.68961 -0.001553
H  -3.653695 -2.417834 -0.891064
H  -3.655554 -2.417013 0.891471
H  1.311673 -3.243229 -0.890152
H  1.311446 -3.242895 0.891758
H  2.870991 -3.252753 0.001001
