program: Gaussian 09
title: 000147417
version: EM64L-G09RevD.01
frameworkgroup: C1[X(C17H12O)]
method: RPBEPBE
basis: SDD
operation: Freq
keyword: #pfreq=noraman
keyword: PBEPBE/SDD
title: #p freq=noraman PBEPBE/SDD
converged: NO YES NO NO
title: Mulliken charges:
elementType: O C C C C C C C C C C C C C C C C C H H H H H H H H H H H H
charge: -0.223924 -0.090110 0.319345 -0.540643 0.312573 -0.518653 0.275800 0.037733 -0.440139 0.174759 -0.416293 -0.459729 0.429905 -0.485054 -0.353079 -0.439241 -0.256909 -0.249233 0.240033 0.239967 0.253213 0.253187 0.244205 0.226530 0.302919 0.238823 0.219555 0.244767 0.228684 0.231010
chargesum: 0.00000
title: Mulliken charges with hydrogens summed into heavy atoms:
elementType: O C C C C C C C C C C C C C C C C C
charge: -0.223924 -0.090110 0.319345 -0.060643 0.312573 -0.012253 0.275800 0.037733 -0.195934 0.174759 -0.189762 -0.156810 0.429905 -0.246231 -0.133524 -0.194474 -0.028225 -0.018224
polarizability: 3.19712908e+02 -5.68836970e+00 2.00285092e+02 -2.04976344e-04 7.73004656e-03 7.75357018e+01
1716.lowfreq: -6.2178 -0.0007 0.0003 0.0005 5.1572 15.1914 59.0141 75.2158 88.1828
frequency: 59.0044 75.1928 88.1657 126.7408 167.3733 191.4324 231.9208 257.8447 303.6803 353.9661 399.1673 430.7118 441.1563 474.7294 518.4786 523.7736 525.6111 539.9362 581.6827 590.9469 603.0008 629.1635 647.0885 685.1139 731.1622 762.3873 776.9818 785.1775 829.5189 833.6466 850.6608 859.0102 866.2693 896.1569 958.9069 961.4973 971.6461 991.8072 1000.3000 1009.8556 1016.7580 1019.6260 1040.5404 1074.6791 1136.6884 1143.2064 1166.6832 1177.8680 1187.6169 1199.9221 1224.5904 1236.9709 1246.6266 1253.4051 1271.6492 1301.0583 1323.7778 1373.3513 1403.1470 1404.8889 1426.4489 1434.1955 1441.5528 1452.5954 1463.4543 1500.8781 1535.0917 1578.1651 1598.5245 1608.3277 1620.4790 1627.5441 2993.4262 3017.5343 3039.0438 3074.2214 3122.6866 3126.2508 3129.1543 3133.5137 3148.6051 3158.2005 3165.7608 3167.3262
redmass: 4.3304 4.4906 2.0453 3.6471 5.9882 4.6719 3.8824 7.0392 3.7296 6.8976 3.3582 5.0451 3.2990 5.9478 2.9583 5.2452 3.1616 5.1242 7.5529 2.9109 6.3795 2.7622 7.1998 5.8075 2.4867 1.3119 5.7168 1.7111 6.0843 1.6012 1.5957 4.5703 2.0542 1.8689 1.4147 4.6310 1.4147 1.3408 1.9906 2.7847 1.3536 4.7540 2.3546 3.3650 1.2150 1.5542 1.3060 1.1481 1.6916 1.1147 2.3942 1.7953 1.5432 1.7624 1.7313 2.2041 2.6879 3.3168 3.0611 6.0739 2.2618 1.4713 2.5997 1.8626 1.2746 3.5279 4.3206 7.8139 6.4194 9.0548 7.4084 6.8745 1.0599 1.0620 1.1021 1.1014 1.0866 1.0892 1.0878 1.0888 1.0949 1.0951 1.0986 1.0963
irintensity: 0.1522 5.5895 0.0327 0.6489 3.6018 0.0576 4.7005 1.4612 1.6214 1.0496 0.9533 0.8952 10.9884 0.5240 0.9945 12.4100 0.3737 3.1871 1.0537 1.3799 16.0860 1.9285 10.9365 0.2391 2.7446 67.1451 0.8605 15.5182 2.4516 7.0022 23.1598 4.3253 35.4018 26.4408 5.1800 18.1856 0.9378 0.2594 0.0236 3.8787 0.3318 0.1138 19.8051 37.5966 0.4038 11.2410 1.4502 3.7877 48.9839 0.0072 12.3983 9.7232 34.5072 19.1656 1.4941 28.9721 10.4950 47.2807 6.7835 3.1377 3.3545 3.4051 5.9947 21.5724 8.6020 50.2077 16.9256 55.9326 6.1192 173.5739 55.4926 24.1771 26.7639 14.8504 7.8519 12.8955 0.8526 12.6572 4.2646 14.3429 12.7863 26.9509 37.8786 13.9256
temp: 298.150 k
press: 1.00000 atm
elementType: 8 6 6 6 6 6 6 6 6 6 6 6 6 6 6 6 6 6 1 1 1 1 1 1 1 1 1 1 1 1
symmnumber: 1
zpe: 617852.7 jmol-1
zpe.correction: 0.235328 hartree
zpe.thermalcorrener: 0.248360 hartree
zpe.thermalcorrenthalpy: 0.249305 hartree
zpe.thermalcorrgfe: 0.195650 hartree
zpe.sumelectzpe: -729.063182 hartree
zpe.sumelectthermal: -729.050149 hartree
zpe.sumelectthermalent: -729.049205 hartree
zpe.sumelectthermalfe: -729.102859 hartree
dipole: -0.7015 -3.6774 0.0009
dipole: 3.7437
quadrupole: -86.8662 -99.2454 -108.3717
quadrupole: -12.0579 0.0030 0.0029
quadrupole: 11.2950 -1.0843 -10.2106 -12.0579 0.0030 0.0029
hfenergy: -729.2985093 hartree
pointgroup: C01 [X(C17H12O1)]
dipole: 0.2679408 -1.4483228 -0.0003356 debye
polarizability: 319.7724554|5.0241822|200.2255451|-0.0002479|-0.0077288|77.5357018 unknown
InChI: InChI=1S/C17H12O/c18-16-10-7-12-6-8-14-13-4-2-1-3-11(13)5-9-15(14)17(12)16/h1-6,8-9H,7,10H2
charge 0 multiplicity 1
30 atoms
O  -3.045698 2.357484 0.000194
C  -1.940686 0.142717 0.000119
C  -2.430098 -1.178397 0.000283
C  -3.952035 -1.228547 0.000657
C  -0.533286 0.430361 0.000072
C  -4.388051 0.262432 -0.001221
C  0.388177 -0.682258 0.000083
C  -3.085867 1.093952 0.000038
C  -1.524296 -2.268763 0.000278
C  1.829831 -0.419854 0.000025
C  -0.145098 -2.011987 0.000165
C  -0.033039 1.784784 0.000005
C  2.290029 0.949125 -0.000051
C  1.328942 2.026757 -0.000062
C  2.813416 -1.457295 0.000067
C  3.692781 1.2259 -0.000095
C  4.183824 -1.16361 0.000021
C  4.631847 0.18911 -0.000063
H  -4.330347 -1.770084 0.887924
H  -4.331053 -1.772848 -0.884581
H  -4.987358 0.534896 -0.888779
H  -4.990697 0.536655 0.883473
H  -1.892753 -3.300729 0.000332
H  0.54023 -2.86532 0.000125
H  -0.7612 2.600622 0.000051
H  1.70516 3.057045 -0.000114
H  2.504732 -2.507359 0.000146
H  4.021454 2.272008 -0.00015
H  4.915073 -1.979532 0.000054
H  5.704366 0.411434 -0.000097
