program: Gaussian 09
title: 000147416
version: EM64L-G09RevD.01
frameworkgroup: C1[X(C11H12N2)]
method: RPBEPBE
basis: SDD
operation: Freq
keyword: #pfreq=noraman
keyword: PBEPBE/SDD
title: #p freq=noraman PBEPBE/SDD
converged: YES YES NO NO
title: Mulliken charges:
elementType: N N C C C C C C C C C C C H H H H H H H H H H H H
charge: -0.640529 -0.236071 0.319209 0.237592 0.373245 0.027118 -0.418412 -0.537763 -0.414452 -0.421093 -0.673636 -0.241994 -0.246922 0.178335 0.247931 0.227610 0.250003 0.210614 0.203863 0.249644 0.227425 0.229378 0.315588 0.315421 0.217895
chargesum: 0.00000
title: Mulliken charges with hydrogens summed into heavy atoms:
elementType: N N C C C C C C C C C C C
charge: -0.009520 -0.018175 0.319209 0.237592 0.373245 0.027118 -0.418412 -0.111498 -0.186842 -0.171090 -0.009514 -0.014568 -0.017544
polarizability: 1.89376718e+02 7.99053977e+00 1.62853233e+02 7.44392443e+00 1.72911921e+00 6.49318156e+01
1716.lowfreq: -7.9081 -3.0763 -0.0009 -0.0005 -0.0003 3.0898 38.9122 79.4115 133.1190
frequency: 38.7122 79.3936 133.1189 158.3937 192.8774 203.8827 235.1114 281.9977 294.1972 346.5022 377.4746 423.3730 436.5622 484.8683 510.1462 522.5116 572.3142 615.6384 638.8616 681.6723 720.1848 758.9825 764.7508 795.7180 820.4580 842.9099 846.0466 885.5404 939.8510 972.5104 979.9663 1016.1308 1021.3816 1063.0895 1071.6197 1119.8122 1149.5750 1170.8321 1180.9418 1200.0866 1253.9402 1280.4519 1310.7656 1332.5763 1378.5131 1407.3782 1428.9509 1445.4524 1465.4731 1471.1293 1480.3660 1489.5293 1577.4689 1606.4749 1614.8707 1624.5782 1659.2816 2959.7151 2978.0101 3032.1236 3071.6919 3093.5429 3114.6248 3120.6518 3139.7833 3162.4334 3302.1909 3558.0647 3695.7649
redmass: 2.5847 3.7877 4.0493 3.8392 1.5309 2.7828 3.4718 1.6833 3.5978 1.2124 3.6121 1.8059 2.5757 2.6446 3.0336 5.8748 5.8347 3.3210 4.5612 5.1180 1.9880 1.6089 2.0240 2.7940 2.2814 2.7845 1.2727 1.6789 1.4615 2.1794 1.3315 2.2598 1.6561 1.9525 2.9107 1.7132 1.8226 1.2033 1.9039 2.2581 1.4058 1.3299 1.4407 2.5280 1.2709 4.5470 2.7363 2.4948 1.1441 1.3110 2.0188 1.1661 7.5310 5.7169 3.7614 2.1537 2.8986 1.0645 1.0357 1.0951 1.1000 1.1004 1.0877 1.0896 1.0921 1.0997 1.0754 1.0450 1.1036
irintensity: 0.5826 0.7670 2.2349 7.4217 0.2361 0.1207 2.6311 0.4104 10.1945 78.1852 13.2442 112.0160 23.0138 18.4885 4.9024 2.3338 0.0897 6.4393 0.9307 3.6152 104.5182 1.0200 10.8004 30.9289 20.0611 30.1538 30.0296 9.3319 4.1443 21.0016 0.0336 13.2215 6.1065 19.7107 27.4137 6.5447 23.5871 4.2440 6.2447 30.5610 9.6489 2.8674 1.4638 23.3384 11.3295 19.7882 44.8142 2.3112 3.6227 38.3218 15.1356 25.0403 181.7645 3.6433 7.2586 46.1362 234.9261 54.6231 55.4003 3.8982 59.9593 26.2963 13.4291 1.0645 22.3162 32.1178 12.1628 76.2136 24.8293
temp: 298.150 k
press: 1.00000 atm
elementType: 7 7 6 6 6 6 6 6 6 6 6 6 6 1 1 1 1 1 1 1 1 1 1 1 1
symmnumber: 1
zpe: 535949.7 jmol-1
zpe.correction: 0.204132 hartree
zpe.thermalcorrener: 0.216001 hartree
zpe.thermalcorrenthalpy: 0.216946 hartree
zpe.thermalcorrgfe: 0.166320 hartree
zpe.sumelectzpe: -534.939235 hartree
zpe.sumelectthermal: -534.927366 hartree
zpe.sumelectthermalent: -534.926422 hartree
zpe.sumelectthermalfe: -534.977047 hartree
dipole: 1.5723 3.7223 0.1968
dipole: 4.0455
quadrupole: -71.2943 -64.2834 -82.8409
quadrupole: -8.3265 1.0456 -1.4742
quadrupole: 1.5119 8.5228 -10.0347 -8.3265 1.0456 -1.4742
hfenergy: -535.1433671 hartree
pointgroup: C01 [X(C11H12N2)]
dipole: -0.6067647 -1.4711788 0.0275564 debye
dipolederiv: -0.2340971 0.3748624 -0.0139647 0.1069979 -1.441525 -0.0485855 -0.0378132 -0.016218 -0.6269667 -0.2647401 -0.3353782 -0.0193232 -0.2020094 -0.975402 0.0263998 -0.0366634 0.0182221 -0.4126174 0.025819 0.0334405 -0.0025608 0.1373108 -0.8237669 -0.0388223 -0.0068853 -0.0207839 -0.185355 0.3793 0.3557758 -0.0236732 -0.1506137 -0.120868 0.0024224 -0.035787 -0.0391401 0.0424585 -0.2742782 -0.0122969 0.0217137 0.1959075 -0.0094969 -0.0079949 0.0374425 -0.0032474 0.0981271 -0.0665521 -0.2194227 -0.0143569 -0.1339377 1.5441668 0.0695336 0.0161767 0.0464556 0.0498771 0.3225668 -0.2536123 -0.0266659 0.0086781 1.1184958 -0.0012683 -0.0082697 0.045639 0.0005924 0.0863635 -0.0076259 -0.0196691 -0.0537131 0.1259259 0.036526 -0.1417922 0.0105456 0.115256 -0.1922605 -0.1093627 0.0006619 -0.0652112 0.0981208 0.0091211 -0.0009134 0.0158755 -0.1953199 0.0695293 -0.0367591 -0.0106813 -0.0223136 0.1103595 0.0051668 -0.0215356 0.0092719 -0.1577739 -0.0223492 -0.0007576 -0.0395207 0.0294282 0.0513099 -0.0379128 0.0603006 -0.0226675 -0.0065075 0.0748406 0.0945684 -0.0274654 0.1352101 -0.058116 -0.0023696 -0.0222064 -0.0083737 -0.1581699 -0.0644647 -0.0412506 -0.0240615 -0.140901 0.0275515 0.0086543 -0.0147251 0.0079636 -0.179327 -0.0374064 0.0184175 0.0097385 0.121961 -0.1178088 -0.1508848 0.0294577 -0.0834422 -0.0040662 0.0235858 -0.0113037 0.0101774 -0.0868179 0.0028882 0.1108319 0.0279713 0.0669765 -0.0168076 0.0897198 0.0374605 0.0092818 -0.0050509 -0.1356813 -0.004574 0.0070325 -0.0085742 0.1612282 0.0986771 -0.0532721 0.0058639 0.0233919 -0.0909265 -0.0054842 0.0059483 0.0009461 0.156074 -0.3011238 -0.0158393 -0.0123737 -0.008678 0.1004847 0.000423 -0.018179 -0.0069479 0.0603287 0.0867481 -0.0679759 0.0412932 -0.0165562 -0.0530717 0.142066 0.0001209 0.0836737 -0.0434121 0.1160498 0.0759784 0.03541 0.0226611 -0.0555669 -0.1002929 0.0349762 -0.048943 0.0377746 -0.0945586 -0.090556 0.0221433 -0.099571 0.0358146 0.0075983 0.023977 0.0072999 0.1599197 -0.0908692 0.0840676 0.0256621 0.0943404 0.0393924 -0.0110865 0.0275539 -0.0108011 0.1651039 0.1331749 -0.0623144 0.0202095 -0.0057224 0.2158119 0.0047845 0.0259766 -0.0063683 0.3455804 0.1444091 -0.0092897 0.0152936 -0.0305329 0.2501816 0.0008118 0.0170605 -0.0193073 0.3592173 -0.008084 0.2524461 0.0168674 0.1457422 0.1617262 -0.0150638 0.0307757 -0.018055 0.2347856 unknown
polarizability: 189.3470789|8.4218204|163.0035115|-6.2139426|1.2901147|64.8111762 unknown
InChI: InChI=1S/C11H12N2/c1-2-7-10(12)8-5-3-4-6-9(8)11(7)13/h3-6,12H,2,13H2,1H3
charge 0 multiplicity 1
25 atoms
N  1.000447 -2.499123 -0.247776
N  1.175052 2.383839 -0.195415
C  1.492971 -0.055409 -0.261889
C  -0.762956 -0.719703 -0.049612
C  -0.764529 0.703911 -0.02682
C  0.650733 -1.164354 -0.196009
C  0.670127 1.163629 -0.162023
C  2.993529 -0.035819 -0.385649
C  -1.963209 -1.441248 0.056277
C  -1.957754 1.422536 0.101363
C  3.710114 0.150409 0.981574
C  -3.179909 -0.713568 0.18659
C  -3.180066 0.698634 0.20921
H  3.361403 -0.962267 -0.874567
H  3.279566 0.806775 -1.042433
H  -1.987612 -2.537746 0.042713
H  -1.96246 2.519098 0.119456
H  4.808551 0.166996 0.852932
H  3.45414 -0.663161 1.685225
H  3.400797 1.107675 1.435018
H  -4.1283 -1.255613 0.271246
H  -4.127271 1.23927 0.311043
H  1.97374 -2.775432 -0.347286
H  0.293764 -3.228208 -0.224529
H  0.438432 3.117981 -0.119035
