program: Gaussian 09
title: 000147421
version: EM64L-G09RevD.01
frameworkgroup: C1[X(C6H12Br2O4)]
method: RPBEPBE
basis: SDD
operation: Freq
keyword: #p
keyword: freq=noraman
keyword: PBEPBE/SDD
title: #p freq=noraman PBEPBE/SDD
converged: YES YES NO NO
title: Mulliken charges:
elementType: Br Br O O O O C C C C C C H H H H H H H H H H H H
charge: -0.019283 -0.017802 -0.420806 -0.436704 -0.461792 -0.463162 -0.149772 -0.090549 -0.051320 -0.091195 -0.719920 -0.712302 0.260759 0.258822 0.225587 0.254204 0.285071 0.320522 0.279930 0.317124 0.349410 0.367394 0.358143 0.357642
chargesum: 0.00000
title: Mulliken charges with hydrogens summed into heavy atoms:
elementType: Br Br O O O O C C C C C C
charge: -0.019283 -0.017802 -0.071396 -0.069310 -0.103649 -0.105520 0.110987 0.168272 0.174267 0.163009 -0.114327 -0.115248
polarizability: 1.29368610e+02 4.29166262e-01 1.17613510e+02 1.21120294e-01 -5.23697961e+00 8.35031151e+01
1716.lowfreq: -0.0004 -0.0002 0.0006 3.7080 6.2441 13.2890 25.2565 49.6343 67.0306
frequency: 25.2386 49.6307 66.9453 72.5496 98.6310 117.9582 128.8331 172.3261 191.2637 212.5240 259.3125 281.9062 293.6008 343.8421 384.4146 414.7103 426.9420 453.7934 475.1242 479.9428 504.6497 553.1008 607.2782 705.7037 733.3072 813.4843 819.3123 876.1155 891.8436 963.4294 980.8368 996.1459 1010.0069 1052.3426 1065.9731 1081.9998 1135.5397 1141.8310 1186.0438 1197.4631 1209.4542 1218.6422 1227.1045 1278.2755 1290.6949 1299.5436 1339.8562 1348.0338 1348.2319 1359.8482 1384.2358 1395.0292 1435.9988 1437.6500 2979.3427 2983.4495 3014.1811 3055.7816 3064.5460 3067.3756 3155.4547 3161.5470 3518.0748 3520.2241 3524.5981 3527.8925
redmass: 19.2796 6.2040 5.1098 4.6999 4.6566 3.8368 6.9850 7.3042 9.2826 5.8606 3.8483 3.9413 5.1445 2.8441 1.2154 1.1532 1.4112 2.3928 2.6996 1.3728 2.9425 4.6833 4.5682 3.7785 3.7076 2.8410 2.5648 2.4213 2.5725 2.1410 2.0295 2.9150 4.8702 2.9804 2.5349 2.6399 1.2825 1.3390 1.1876 1.2171 1.1594 1.1594 1.1748 1.2786 1.3121 1.2540 1.2686 1.3707 1.5513 1.2118 1.1770 1.5803 1.1188 1.1158 1.0838 1.0834 1.0850 1.0817 1.0585 1.0601 1.1098 1.1095 1.0657 1.0650 1.0648 1.0657
irintensity: 0.1083 0.5256 1.6957 2.4244 3.7929 6.6565 6.6159 3.6144 1.9804 1.7780 14.1624 11.9973 3.8551 6.6399 147.2131 69.8297 120.3398 23.1177 174.3233 138.1799 80.1740 67.8449 16.8079 13.5504 19.9896 19.4263 4.0042 46.3190 25.4716 41.7429 10.4464 20.8324 169.3375 20.3744 15.0092 2.0857 76.0234 8.2242 38.9652 30.8268 55.9115 15.1662 4.6228 25.7218 30.0316 34.1225 4.0629 15.4317 20.2658 9.9166 39.4993 8.6549 21.8627 7.8439 51.1631 27.1529 37.2559 17.6690 8.2852 13.8431 6.3614 3.0058 19.9311 17.5272 21.9766 14.2755
temp: 298.150 k
press: 1.00000 atm
elementType: 35 35 8 8 8 8 6 6 6 6 6 6 1 1 1 1 1 1 1 1 1 1 1 1
symmnumber: 1
zpe: 480964.4 jmol-1
zpe.correction: 0.183190 hartree
zpe.thermalcorrener: 0.198036 hartree
zpe.thermalcorrenthalpy: 0.198981 hartree
zpe.thermalcorrgfe: 0.138343 hartree
zpe.sumelectzpe: -562.633883 hartree
zpe.sumelectthermal: -562.619036 hartree
zpe.sumelectthermalent: -562.618092 hartree
zpe.sumelectthermalfe: -562.678730 hartree
dipole: -0.1090 -1.6197 0.7759
dipole: 1.7993
quadrupole: -93.1519 -104.7427 -90.6883
quadrupole: -0.1478 -0.2850 4.1738
quadrupole: 3.0424 -8.5484 5.5060 -0.1478 -0.2850 4.1738
hfenergy: -562.817073 hartree
pointgroup: C01 [X(C6H12Br2O4)]
dipole: 0.0583815 0.6384051 0.3002457 debye
dipolederiv: -0.4182273 -0.1774924 0.0043523 -0.269833 -0.3030723 -0.0184057 -0.085773 -0.0708111 -0.1994194 -0.3425316 0.2148863 -0.0172041 0.2524779 -0.414459 0.0558967 0.0484017 -0.0109189 -0.1732066 -0.7763166 0.071047 0.0784103 0.052558 -0.7641792 -0.017988 0.0507861 0.003731 -0.1494797 -0.6142639 -0.1325975 -0.2001299 -0.0873536 -0.8061217 -0.062065 -0.1766733 -0.0848613 -0.3286291 -0.5962124 0.0909385 0.002398 0.1073361 -0.3756512 0.0446552 -0.0345142 0.0876581 -0.7221805 -0.7419857 -0.1145175 0.0875021 -0.0875236 -0.3430241 0.0936992 0.1236266 0.1198885 -0.6593178 0.4821848 -0.2058464 -0.0500924 -0.0570929 0.5246263 -0.0276834 0.1928986 0.1236213 0.2151286 0.4854594 0.1145014 0.1697185 0.0277897 0.4681432 0.0684412 0.0227603 0.1337942 0.2312137 0.2743467 -0.1333844 0.0494654 -0.239307 0.0830808 -0.0813499 -0.064049 -0.2382444 0.4324849 0.4054259 0.254796 -0.0791631 0.1497804 -0.0054837 -0.0482515 -0.0324516 -0.2049058 0.3543848 0.3765899 0.3189447 0.1792575 0.3824313 0.3780655 0.1605557 0.1805066 0.1761055 0.0825577 0.3773329 -0.354943 -0.0597757 -0.4193579 0.4726162 0.1079762 -0.04638 0.0925335 -0.0153355 0.0659471 0.0289901 -0.0270849 0.031508 0.0411205 0.0435138 -0.0488346 0.0732253 -0.056443 -0.0145792 0.0350367 -0.060124 0.0673232 -0.0485025 0.0481307 -0.0629937 0.0128848 -0.0889068 -0.0047059 0.0869425 -0.0268544 0.2016855 -0.1288996 0.0283884 0.0139509 -0.0068744 -0.0235955 -0.0205373 -0.06652 -0.0145218 -0.1306415 -0.0410982 -0.0536349 -0.0937399 -0.039737 -0.0320099 0.0330923 -0.0422608 -0.0914488 -0.0602177 0.0251891 0.0051261 -0.0610273 0.018667 -0.0555516 0.0046331 -0.0443226 -0.0287023 0.0461343 -0.0197478 -0.0584565 -0.0336353 -0.0350927 0.082568 -0.0727129 -0.0049023 0.1015937 0.0058451 -0.0154772 0.0072828 0.1194994 0.00872 0.0427715 0.0049028 0.0674733 -0.012139 0.0054442 -0.0027767 -0.1001108 -0.0166978 -0.0358921 0.0451643 0.3709162 0.0246685 -0.0133667 0.0573744 0.4085947 -0.020919 -0.0386654 0.0063688 0.0514473 0.1913484 -0.0403129 0.087018 -0.050542 0.4670578 0.0011139 0.0976475 0.0053239 0.2001615 0.2899582 -0.0609757 -0.1190752 -0.1042904 0.2154464 -0.0765614 -0.0766419 -0.0507217 0.3587179 0.2399352 0.0698505 0.0399666 0.1184714 0.1845528 -0.0993541 0.0219992 -0.0844624 0.4074754 unknown
polarizability: 129.3810927|0.1863265|117.6770842|-0.1960275|4.9805207|83.4270577 unknown
InChI: InChI=1S/C6H12Br2O4/c7-1-3(9)5(11)6(12)4(10)2-8/h3-6,9-12H,1-2H2
charge 0 multiplicity 1
24 atoms
Br 3.902577 1.926997 0.073088
Br -3.198598 2.44796 -0.108722
O  1.440799 -2.081732 -0.593287
O  -1.491559 -2.032451 -0.566845
O  1.787416 -0.171127 1.421416
O  -2.69508 -0.460413 1.29607
C  0.617913 -0.871765 -0.538703
C  -0.683817 -1.129346 0.251899
C  1.465173 0.284497 0.061255
C  -1.532925 0.127209 0.607884
C  2.715949 0.516747 -0.792367
C  -1.961758 0.914398 -0.634631
H  0.361733 -0.660947 -1.59162
H  -0.424522 -1.5961 1.225222
H  0.882448 1.227825 0.103568
H  -0.970936 0.776829 1.306673
H  2.472682 0.922282 -1.786058
H  3.337089 -0.386113 -0.872187
H  -1.123293 1.410606 -1.145939
H  -2.544053 0.294917 -1.331749
H  1.733903 -2.270065 0.337961
H  -2.327037 -2.20024 -0.054968
H  2.489215 0.419686 1.801825
H  -3.353519 0.256846 1.489517
