program: Gaussian 09
title: 000010175
version: EM64L-G09RevD.01
frameworkgroup: C1[X(C14H12O4)]
method: RPBEPBE
basis: SDD
operation: Freq
keyword: #pfreq=noraman
keyword: PBEPBE/SDD
title: #p freq=noraman PBEPBE/SDD
converged: NO YES NO NO
title: Mulliken charges:
elementType: O O O O C C C C C C C C C C C C C C H H H H H H H H H H H H
charge: -0.248794 -0.396705 -0.427090 -0.336275 0.004845 0.117287 0.200774 0.255786 0.361975 0.394896 -0.546521 -0.592853 -0.338640 -0.358318 -0.241064 -0.236203 -0.231675 -0.536868 0.282018 0.233381 0.245213 0.262958 0.227928 0.230028 0.229843 0.382200 0.361354 0.223787 0.222831 0.253901
chargesum: 0.00000
title: Mulliken charges with hydrogens summed into heavy atoms:
elementType: O O O O C C C C C C C C C C C C C C
charge: -0.248794 -0.014505 -0.065736 -0.336275 0.004845 0.117287 0.200774 0.255786 0.361975 0.394896 -0.264503 -0.359471 -0.093427 -0.095360 -0.013136 -0.006175 -0.001832 0.163651
polarizability: 2.76675678e+02 1.31080520e+00 1.72220833e+02 -1.10368138e+01 -7.16264743e+00 9.19677256e+01
1716.lowfreq: -4.1971 -0.0006 -0.0004 0.0003 4.3036 8.7034 34.7934 52.7671 67.3619
frequency: 34.7901 52.7065 67.3589 96.0553 123.9041 180.2078 188.9775 193.3471 233.7410 238.1042 245.3465 253.2364 306.2417 349.1412 355.1357 370.4262 405.9731 435.4323 440.7172 511.3268 533.6921 562.3914 570.6509 594.2699 613.2505 622.7253 640.7046 670.5074 690.4141 701.1355 746.6138 776.6075 796.7152 850.8365 853.6470 892.4864 928.2289 939.0019 969.4101 980.5313 990.3303 998.3747 1013.2106 1022.3514 1028.4847 1084.9330 1110.5521 1138.5849 1153.4509 1164.5903 1173.4347 1179.6978 1189.9096 1222.7541 1280.9280 1311.8786 1320.6860 1364.0180 1383.1877 1398.6811 1412.3035 1435.6971 1440.2561 1470.3132 1471.5181 1476.3962 1487.9846 1541.8612 1576.2626 1587.3937 1609.9401 1647.4019 2667.0009 2965.2297 3056.3671 3126.1090 3131.3565 3138.0212 3144.7833 3150.9688 3161.2969 3170.3198 3198.7878 3570.9695
redmass: 5.6201 4.4476 4.4740 4.3294 6.3612 4.7494 3.0507 3.1196 4.2043 2.5918 4.1492 3.2171 2.7844 6.3633 1.9405 2.3502 2.8045 5.2415 5.7781 6.9278 6.0346 6.0618 7.1215 3.4614 6.4577 4.6344 3.6784 3.2232 4.3352 1.7504 2.7700 2.0029 2.7477 1.8088 1.2457 6.1512 4.2569 1.7277 1.0856 1.4003 5.8457 1.3359 4.4280 3.1615 2.3104 1.5895 1.2572 2.8128 1.6778 1.8321 1.0550 1.6156 1.1162 1.5062 2.9540 2.5481 1.8078 4.3747 8.6322 5.9769 3.1532 2.2965 1.2477 1.0507 1.0664 2.7441 3.5672 2.9342 3.6437 5.9887 6.0402 5.2850 1.0724 1.0329 1.1043 1.0850 1.0995 1.0885 1.0908 1.0930 1.0962 1.1006 1.0929 1.0660
irintensity: 0.3047 0.3756 1.6627 0.9122 2.6550 0.3458 0.7124 1.1974 0.7717 0.0595 1.0176 1.7794 28.5786 3.0598 47.1424 40.2444 1.8293 17.8244 7.8560 8.4554 2.0470 19.9315 1.8709 15.8899 0.2092 4.1644 34.0202 17.7777 15.6100 49.1737 15.9586 29.3379 20.1108 63.0069 3.7696 25.9355 13.6615 9.2867 134.0368 2.9077 1.8906 0.7957 16.1738 132.1008 22.3667 15.9120 0.2314 78.1326 45.4260 169.4589 0.1211 27.5191 20.4379 143.6030 76.0048 312.7954 159.6411 45.5345 10.1651 78.2312 90.0650 39.3955 5.1330 15.5900 48.5264 80.5492 125.8215 66.8689 242.9566 1.6204 32.7599 673.1068 441.2599 64.7120 43.7357 0.0681 21.2284 8.0750 6.5360 28.0327 23.0967 16.4855 0.2856 35.6162
temp: 298.150 k
press: 1.00000 atm
elementType: 8 8 8 8 6 6 6 6 6 6 6 6 6 6 6 6 6 6 1 1 1 1 1 1 1 1 1 1 1 1
symmnumber: 1
zpe: 593255.5 jmol-1
zpe.correction: 0.225959 hartree
zpe.thermalcorrener: 0.241596 hartree
zpe.thermalcorrenthalpy: 0.242541 hartree
zpe.thermalcorrgfe: 0.182802 hartree
zpe.sumelectzpe: -840.294759 hartree
zpe.sumelectthermal: -840.279121 hartree
zpe.sumelectthermalent: -840.278177 hartree
zpe.sumelectthermalfe: -840.337916 hartree
dipole: -1.3131 -7.1219 -0.9239
dipole: 7.3006
quadrupole: -87.4466 -100.7716 -104.8970
quadrupole: 10.4270 1.8755 -1.5467
quadrupole: 10.2585 -3.0666 -7.1919 10.4270 1.8755 -1.5467
hfenergy: -840.5207179 hartree
pointgroup: C01 [X(C14H12O4)]
dipole: 0.6859189 -2.7538959 0.4422705 debye
polarizability: 276.3639991|4.6457515|172.7537277|-12.2945274|4.0844486|91.7465099 unknown
InChI: InChI=1S/C14H12O4/c1-18-10-7-11(15)13(12(16)8-10)14(17)9-5-3-2-4-6-9/h2-8,15-16H,1H3
charge 0 multiplicity 1
30 atoms
O  4.61438 -0.115468 -0.333586
O  1.03712 2.993121 -0.540919
O  0.076671 -1.573573 0.857862
O  -1.283854 2.321481 0.037825
C  0.440742 0.670498 0.010734
C  -0.97868 1.054124 0.022588
C  1.422524 1.694658 -0.330346
C  0.968015 -0.616846 0.353403
C  -2.124851 0.099164 -0.073025
C  3.242457 0.088064 -0.183755
C  2.791391 1.391707 -0.460902
C  2.339078 -0.922293 0.250223
C  -2.084633 -1.046067 -0.909433
C  -3.333669 0.433345 0.592394
C  -3.232136 -1.850304 -1.067012
C  -4.472169 -0.386748 0.45635
C  -4.424979 -1.530678 -0.375788
C  5.15987 -1.442018 -0.027394
H  3.495813 2.174846 -0.745527
H  2.695251 -1.921077 0.523969
H  -1.164567 -1.293097 -1.448113
H  -3.363378 1.340403 1.204486
H  -3.199551 -2.722102 -1.729832
H  -5.395972 -0.131289 0.986714
H  -5.312756 -2.162602 -0.49265
H  0.02354 3.045882 -0.299891
H  0.558384 -2.396881 1.122193
H  4.720385 -2.218064 -0.683065
H  4.99664 -1.707708 1.034784
H  6.237931 -1.357678 -0.225488
