program: Gaussian 09
title: 000147437
version: EM64L-G09RevD.01
frameworkgroup: C1[X(C24H28N2)]
method: RPBEPBE
basis: SDD
operation: Freq
keyword: #pfreq=noraman
keyword: PBEPBE/SDD
title: #p freq=noraman PBEPBE/SDD
converged: YES YES NO NO
title: Mulliken charges:
elementType: N N C C C C C C C C C C C C C C C C C C C C C C C C H H H H H H H H H H H H H H H H H H H H H H H H H H H H
charge: -0.157728 -0.157728 0.038133 0.038134 0.366306 0.366307 0.369795 0.369795 -0.375204 -0.375204 -0.375775 -0.375773 -0.550118 -0.550119 -0.551979 -0.551980 -0.422086 -0.422085 -0.421142 -0.421142 0.354848 0.354849 -0.637856 -0.637857 -0.641062 -0.641064 0.205874 0.200974 0.205874 0.200974 0.201245 0.205761 0.201245 0.205761 0.224224 0.213570 0.224224 0.213569 0.212575 0.227610 0.212574 0.227610 0.219085 0.200418 0.219085 0.200418 0.200458 0.219465 0.200458 0.219466 0.236768 0.236768 0.235841 0.235842
chargesum: 0.00000
title: Mulliken charges with hydrogens summed into heavy atoms:
elementType: N N C C C C C C C C C C C C C C C C C C C C C C C C
charge: -0.157728 -0.157728 0.038133 0.038134 0.366306 0.366307 0.369795 0.369795 0.031644 0.031644 0.031231 0.031232 -0.112325 -0.112326 -0.111795 -0.111796 -0.002583 -0.002582 -0.001218 -0.001218 0.354848 0.354849 -0.401088 -0.401089 -0.405221 -0.405222
polarizability: 4.76080790e+02 1.89613356e+00 2.72023400e+02 -1.36641461e-04 -5.60480674e-04 1.64146046e+02
1716.lowfreq: -8.2924 -0.0009 -0.0005 -0.0003 1.3168 10.7205 27.2455 32.3298 47.5369
frequency: 27.2435 32.3261 47.5367 77.3913 81.7503 83.9049 103.2818 125.6901 131.4260 177.0470 203.6599 206.2624 210.2169 226.2642 294.1317 301.8643 307.2221 309.2410 333.7331 370.2996 393.3409 393.9095 406.6110 407.5748 435.5898 444.3307 461.0057 492.8593 499.8414 502.9658 526.1790 526.2792 529.9934 553.0655 587.4700 588.9935 632.6639 642.2225 650.6097 650.6978 736.2436 740.8066 777.6855 845.0585 846.2887 849.3368 851.6052 860.3512 868.1223 881.3291 881.7435 893.3593 896.6451 900.0281 901.6182 904.9421 907.7886 913.3183 933.1706 971.3767 1017.6333 1018.0445 1025.3126 1029.9157 1063.6212 1064.9366 1066.1439 1075.4337 1075.6385 1081.0409 1081.2488 1093.8568 1116.3670 1150.7006 1151.1458 1180.7987 1181.1597 1185.4347 1194.4308 1196.1911 1199.3820 1212.9735 1214.7846 1217.3111 1236.5260 1247.3991 1252.4322 1263.1032 1264.2374 1280.8288 1286.3378 1311.1000 1315.0504 1320.4116 1322.0644 1327.7557 1330.7218 1337.1615 1344.6760 1346.6239 1347.2869 1347.3002 1349.3196 1355.0130 1357.7759 1371.3653 1396.6083 1411.3305 1425.0516 1448.0145 1449.7401 1455.9572 1456.7916 1456.9483 1463.5463 1463.9511 1464.5186 1465.0805 1473.7216 1475.3478 1475.3939 1484.8968 1513.4537 1526.3461 1572.2753 1580.8992 1619.8929 1625.8145 2884.2941 2884.3039 2890.4046 2891.4509 2955.6400 2955.7741 2955.9111 2956.2011 2993.7220 2993.7293 2994.7112 2994.7544 3010.6370 3010.6532 3012.5658 3012.8619 3028.0948 3028.1744 3028.7543 3028.9942 3061.0281 3061.0423 3061.5515 3061.7056 3107.7236 3111.5663 3113.3991 3117.1000
redmass: 3.7992 4.0437 3.9672 2.9870 2.3791 2.3466 2.7244 3.4966 3.6482 5.1788 3.4326 3.3001 3.3925 3.7597 1.8897 1.9131 1.7743 1.8033 4.8506 4.0013 3.9606 4.7370 3.2952 3.2474 4.1879 4.3833 3.2956 3.8744 3.7055 3.4285 3.3622 3.8005 2.5707 2.7703 3.7033 3.1856 2.8445 4.8118 3.1900 2.5383 3.5281 4.1396 5.2981 1.6277 1.6402 1.8167 1.9030 1.4681 1.5594 2.5363 2.5003 1.5803 1.9267 2.0344 2.2891 1.4151 1.7669 1.7744 2.5323 3.0917 2.4729 2.4758 2.8257 2.5040 2.5057 2.0302 2.4704 1.7972 1.8013 1.7088 1.7137 2.4708 1.9619 1.3446 1.3429 1.2850 1.2938 1.5014 1.3331 1.3560 1.5926 2.1214 2.1931 1.6279 1.3317 1.3236 2.1368 1.3492 1.2692 1.3448 1.3283 2.2081 1.7864 1.7130 1.4868 1.3887 1.6947 1.6675 1.4597 1.5867 1.4058 1.4086 1.4661 3.0776 2.7224 7.4348 1.6835 2.0945 5.7736 1.4004 4.4886 1.1643 1.0967 1.1160 1.0994 1.1134 1.1028 1.1058 1.2985 1.0858 1.0868 1.3397 1.5454 2.2669 6.5004 7.7613 6.2129 6.7464 1.0695 1.0695 1.0717 1.0718 1.0660 1.0660 1.0658 1.0659 1.0666 1.0666 1.0651 1.0653 1.0863 1.0862 1.0856 1.0855 1.0924 1.0923 1.0922 1.0920 1.1042 1.1042 1.1041 1.1041 1.0905 1.0905 1.0894 1.0905
irintensity: 0.0371 1.8601 0.8967 1.6452 0.0771 0.0071 0.8705 7.3034 9.0293 0.0046 5.5477 6.5888 0.0324 0.0008 2.7453 0.1361 10.3454 9.6607 0.1057 1.5835 0.2516 3.0382 0.1800 1.9230 7.7699 34.4579 0.0128 0.0107 1.2524 0.0198 0.1922 0.0573 3.9130 0.4810 2.2630 1.2451 1.6797 2.0204 3.1920 0.4599 3.7364 11.6047 1.4867 3.7172 1.6715 0.0013 0.1922 10.6424 16.4561 0.2729 6.6112 41.9249 5.2696 0.2302 1.0668 4.2607 0.3981 0.9056 5.4077 3.7691 0.0821 0.9909 2.6459 2.5003 30.3436 0.1912 2.8859 2.9772 0.1681 0.3305 5.6261 2.8066 36.4363 0.9619 11.9477 2.9266 52.9941 0.3643 0.0359 2.8254 110.2751 5.4391 69.0887 0.2590 0.8969 7.0733 3.6822 2.1191 5.7419 0.0269 0.2315 494.8796 0.1789 2.1782 10.7836 0.0104 108.9861 26.0198 2.1393 0.0072 0.3128 0.0377 0.2003 0.8737 1.4786 1.4954 20.7359 0.2719 11.9314 191.3390 0.0652 5.9181 8.4781 2.8879 39.9853 0.4016 32.6180 17.6312 208.8314 0.7444 0.0495 4.9842 315.0582 1.7289 2.5209 0.2204 0.0079 76.3533 5.5300 60.4844 379.0268 171.2626 3.6432 96.4361 4.6319 51.6651 3.4705 41.5263 5.6174 11.6617 0.0750 3.5467 319.8575 24.4082 18.5037 73.0092 43.6621 58.9452 9.0922 59.8642 67.5479 87.7270 5.5064 19.4698 35.9317 0.0059
temp: 298.150 k
press: 1.00000 atm
elementType: 7 7 6 6 6 6 6 6 6 6 6 6 6 6 6 6 6 6 6 6 6 6 6 6 6 6 1 1 1 1 1 1 1 1 1 1 1 1 1 1 1 1 1 1 1 1 1 1 1 1 1 1 1 1
symmnumber: 1
zpe: 1220536.9 jmol-1
zpe.correction: 0.464878 hartree
zpe.thermalcorrener: 0.486432 hartree
zpe.thermalcorrenthalpy: 0.487376 hartree
zpe.thermalcorrgfe: 0.414316 hartree
zpe.sumelectzpe: -1039.003242 hartree
zpe.sumelectthermal: -1038.981688 hartree
zpe.sumelectthermalent: -1038.980744 hartree
zpe.sumelectthermalfe: -1039.053804 hartree
dipole: 0.0000 0.0000 -0.5393
dipole: 0.5393
quadrupole: -114.1800 -141.0800 -157.9350
quadrupole: 0.9375 0.0000 -0.0001
quadrupole: 23.5517 -3.3483 -20.2033 0.9375 0.0000 -0.0001
hfenergy: -1039.4681202 hartree
pointgroup: C01 [X(C24H28N2)]
dipole: -0.0000004 -0.0000008 -0.2121869 debye
polarizability: 476.0809853|1.8856076|272.0232048|-0.0001367|-0.0005605|164.1460458 unknown
InChI: InChI=1S/C24H28N2/c1-5-17-13-21(14-18-6-2-10-25(9-1)23(17)18)22-15-19-7-3-11-26-12-4-8-20(16-22)24(19)26/h13-16H,1-12H2
charge 0 multiplicity 1
54 atoms
N  -5.042398 -0.014292 -0.026146
N  5.042409 0.014272 -0.026146
C  -3.629871 -0.016582 -0.052295
C  3.629882 0.016567 -0.0523
C  -2.903048 1.173241 -0.384636
C  2.903056 -1.173258 -0.38463
C  -2.894585 -1.202426 0.275532
C  2.894598 1.202416 0.275511
C  -5.787535 1.132635 -0.570437
C  5.787545 -1.132659 -0.570429
C  -5.776711 -1.282687 0.109706
C  5.776726 1.282668 0.109694
C  -3.647251 2.444099 -0.78282
C  3.647259 -2.444118 -0.782809
C  -3.628786 -2.494982 0.61986
C  3.628802 2.494975 0.619821
C  -5.084821 2.458155 -0.222517
C  5.084827 -2.458176 -0.222503
C  -5.067275 -2.220274 1.104611
C  5.067288 2.220269 1.104582
C  -0.743299 -0.003396 -0.042999
C  0.74331 0.003386 -0.043001
C  -1.495386 1.156682 -0.369961
C  1.495395 -1.156696 -0.369953
C  -1.486716 -1.169912 0.280634
C  1.486728 1.169905 0.280616
H  -6.806961 1.114614 -0.138696
H  -5.899715 1.054659 -1.678494
H  6.80697 -1.114638 -0.138685
H  5.899728 -1.054689 -1.678487
H  -5.880917 -1.79944 -0.874503
H  -6.799357 -1.04975 0.46437
H  5.88094 1.799405 -0.874523
H  6.799368 1.04973 0.464369
H  -3.088141 3.33225 -0.433251
H  -3.692792 2.521012 -1.889656
H  3.088145 -3.332267 -0.433241
H  3.692802 -2.521033 -1.889645
H  -3.670591 -3.151889 -0.274471
H  -3.063161 -3.054216 1.388636
H  3.670615 3.151867 -0.274522
H  3.063177 3.054226 1.388585
H  -5.062976 2.575464 0.877265
H  -5.660428 3.303501 -0.643614
H  5.06298 -2.575477 0.87728
H  5.660432 -3.303525 -0.643595
H  -5.636555 -3.164119 1.195531
H  -5.047197 -1.737488 2.099739
H  5.63657 3.164115 1.195493
H  5.047203 1.737497 2.099716
H  -0.966452 2.075278 -0.655348
H  0.966459 -2.075294 -0.655331
H  -0.951414 -2.081913 0.575061
H  0.951429 2.08191 0.575031
