program: Gaussian 09
title: 000147390
version: EM64L-G09RevD.01
frameworkgroup: C1[X(C5Cl4O2)]
method: RPBEPBE
basis: SDD
operation: Freq
keyword: #pfreq=noraman
keyword: PBEPBE/SDD
title: #p freq=noraman PBEPBE/SDD
converged: NO NO NO NO
title: Mulliken charges:
elementType: Cl Cl Cl Cl O O C C C C C
charge: 0.067217 0.072440 0.129215 0.093706 -0.251487 -0.139799 0.741990 -0.161104 -0.164154 0.206051 -0.594076
chargesum: 0.00000
title: Mulliken charges with hydrogens summed into heavy atoms:
polarizability: 1.77384051e+02 1.40269796e+01 1.20794782e+02 -2.47325669e-03 -4.05885468e-03 3.48167667e+01
1716.lowfreq: -7.6003 0.0034 0.0035 0.0036 7.0705 10.9793 58.4524 66.9850 120.3983
frequency: 58.4432 66.9849 120.3967 132.5539 166.8176 209.9624 234.7226 263.7868 298.1959 337.0774 356.7534 431.7922 463.0651 521.9384 610.0936 632.7144 684.3274 695.1080 843.5535 870.2851 905.1817 989.0603 1150.8337 1231.9734 1553.7188 1626.7264 1726.5933
redmass: 32.0927 24.2053 27.1668 15.9106 31.6633 25.7659 25.0990 13.6955 22.0473 12.9413 29.9080 21.0985 12.2720 18.1930 14.0643 12.3397 13.9411 12.1699 13.2431 12.8868 13.5249 13.2810 12.4336 12.1170 12.0376 12.0245 13.0328
irintensity: 0.1055 0.4683 0.2347 0.5315 0.0030 0.3617 0.6103 0.4220 0.5566 0.8764 1.7342 4.5783 0.1218 11.0690 0.4815 13.8269 41.3073 4.7668 189.2926 23.8117 160.0918 15.0920 58.2881 30.8030 73.3062 110.1867 502.4357
temp: 298.150 k
press: 1.00000 atm
elementType: 17 17 17 17 8 8 6 6 6 6 6
symmnumber: 1
zpe: 102775.1 jmol-1
zpe.correction: 0.039145 hartree
zpe.thermalcorrener: 0.049787 hartree
zpe.thermalcorrenthalpy: 0.050731 hartree
zpe.thermalcorrgfe: 0.000651 hartree
zpe.sumelectzpe: -2180.369382 hartree
zpe.sumelectthermal: -2180.358740 hartree
zpe.sumelectthermalent: -2180.357796 hartree
zpe.sumelectthermalfe: -2180.407877 hartree
dipole: -1.5296 -3.0654 0.0017
dipole: 3.4258
quadrupole: -89.6847 -96.5696 -87.7341
quadrupole: -5.4527 0.0025 0.0039
quadrupole: 1.6448 -5.2401 3.5954 -5.4527 0.0025 0.0039
hfenergy: -2180.4085275 hartree
pointgroup: C01 [X(C5Cl4O2)]
dipole: -0.8176415 1.0714973 -0.0006748 debye
dipolederiv: -0.0180866 0.1052173 -0.0000022 0.0764352 -0.6004143 -0.0000044 0.0001305 -0.0001369 0.0478421 -0.5948478 -0.1887737 -0.0001093 -0.3919687 -0.1191769 -0.0000979 -0.0000938 -0.00009 0.047054 -0.3496958 -0.2585426 0.0000499 -0.4797626 -0.5639651 0.0001042 0.0000546 0.000075 0.0787785 -0.4329266 0.2384359 0.0000073 0.468608 -0.4611711 0.0000343 -0.0000278 0.0000453 0.0705761 -1.0159797 0.1328067 -0.000188 -0.0521938 -0.5308658 -0.000111 0.0003488 0.0000146 -0.189727 -0.9833103 0.3443379 0.0003872 0.7180435 -0.7834266 -0.0003849 -0.0009733 0.0005741 -0.288194 -0.4035633 -0.1383932 0.0002336 -0.5301308 -0.0589022 0.0000901 0.0001378 -0.0000119 0.2069636 0.5515227 -0.3118999 -0.0001635 0.0073128 0.9499876 -0.0000437 -0.0003232 0.0000487 -0.0413625 0.597662 0.4225619 0.000303 1.1424527 -0.3535456 0.0001775 0.000178 -0.0001296 -0.0678226 1.3656816 -0.5005174 -0.0003555 -0.9494665 1.2513671 0.0004315 0.0005652 -0.000248 0.3096554 1.2835438 0.1547671 -0.0001626 -0.0093297 1.2701129 -0.0001958 0.0000031 -0.0001413 -0.1737637 unknown
polarizability: 180.5633975|-2.5944176|117.6154351|0.0031918|-0.0035219|34.8167667 unknown
InChI: InChI=1S/C5Cl4O2/c6-1-2(7)5(10)11-3(1)4(8)9
charge 0 multiplicity 1
11 atoms
Cl -0.090274 2.680295 -0.000016
Cl 3.096168 1.27668 0.00045
Cl -2.887681 -1.782901 0.000365
Cl -3.104358 1.223647 0.00001
O  0.050471 -1.376885 0.000028
O  2.336458 -1.950046 0.000397
C  -0.678705 -0.150821 -0.00013
C  0.288534 0.945152 -0.000302
C  1.555362 0.410579 -0.000135
C  1.478804 -1.063416 -0.000859
C  -2.044879 -0.212283 0.000092
