program: Gaussian 09
title: 000147411
version: EM64L-G09RevD.01
frameworkgroup: C1[X(C12H26O6S2)]
method: RPBEPBE
basis: SDD
operation: Freq
keyword: #p
keyword: freq=noraman
keyword: PBEPBE/SDD
title: #p freq=noraman PBEPBE/SDD
converged: YES YES NO NO
title: Mulliken charges:
elementType: S S O O O O O O C C C C C C C C C C C C H H H H H H H H H H H H H H H H H H H H H H H H H H
charge: 1.054720 1.059083 -0.418661 -0.428339 -0.518909 -0.518904 -0.518860 -0.518359 -0.383563 -0.384400 -0.376225 -0.372180 -0.379891 -0.363764 -0.381424 -0.397654 -0.276268 -0.273529 -0.731663 -0.731340 0.195134 0.195603 0.194750 0.195568 0.196224 0.197028 0.193897 0.189739 0.197678 0.198217 0.220026 0.190480 0.217171 0.217501 0.219797 0.208989 0.227857 0.227382 0.223833 0.237515 0.288438 0.281076 0.288545 0.287574 0.281404 0.288704
chargesum: 0.00000
title: Mulliken charges with hydrogens summed into heavy atoms:
elementType: S S O O O O O O C C C C C C C C C C C C
charge: 1.054720 1.059083 -0.418661 -0.428339 -0.518909 -0.518904 -0.518860 -0.518359 0.007174 0.005919 0.017027 0.011455 0.016003 0.046741 0.053248 0.031132 0.178971 0.187820 0.126397 0.126342
polarizability: 2.87546985e+02 -2.11343670e+00 1.87765126e+02 -1.66173605e+00 -6.56911956e-01 1.72269223e+02
1716.lowfreq: -0.0020 -0.0012 0.0010 0.4972 2.4769 5.8039 10.9447 12.1867 12.9251
frequency: 9.8052 11.8790 12.7954 15.3829 22.2021 29.1820 41.6098 51.4008 67.3511 76.7299 85.2836 99.2163 113.6859 116.8845 123.3867 145.7061 149.5963 150.7222 153.5115 156.1075 192.1592 205.4680 217.6328 219.3950 245.3829 252.0234 283.8277 297.5118 297.6647 334.2851 346.8619 357.8234 379.5941 391.7381 438.3454 463.1465 491.9508 568.8340 578.1742 601.1082 603.1257 723.8919 728.8661 742.9219 769.5921 806.7483 837.1132 837.1780 853.6270 880.3643 903.7385 911.2139 912.1540 914.2188 955.1726 986.4252 991.4297 996.9753 1003.5205 1015.3253 1028.6996 1038.1144 1038.9163 1050.7087 1059.3088 1077.5770 1080.7064 1084.7381 1108.1130 1140.5499 1152.5401 1193.1021 1201.6735 1219.8820 1235.3499 1251.6699 1265.4593 1276.9348 1282.0961 1285.1422 1291.4927 1297.1182 1299.0882 1314.6036 1315.4702 1316.4031 1340.5946 1351.3668 1354.9950 1357.0774 1363.5190 1364.9648 1415.6033 1416.0548 1418.9141 1419.0393 1445.5251 1460.6625 1461.6277 1465.8450 1467.1573 1473.1652 1479.1372 1480.3254 1485.9152 1490.0472 2950.0447 2951.8376 2955.1572 2960.0858 2966.5751 2968.9171 2973.7037 2977.8554 2981.8901 2986.1071 2993.3383 2996.5267 3004.4879 3018.9223 3027.0613 3036.1458 3041.7062 3041.9682 3042.1813 3048.8443 3057.5451 3070.5043 3190.6770 3190.7155 3198.7827 3198.9346
redmass: 5.9601 6.7452 7.8333 6.2987 6.1731 4.2882 3.1433 2.6682 3.1190 2.4769 2.6032 6.1215 2.8649 2.0940 3.1902 2.4198 1.0638 1.7731 1.1051 2.7223 3.9231 2.9404 4.6877 4.2961 3.6053 3.7355 4.6093 7.7280 7.5576 5.6830 7.5309 7.3482 4.5001 6.1708 4.4586 3.3791 3.5786 7.3769 4.0845 8.9092 8.9798 1.0667 1.1024 1.1556 1.2226 1.3381 11.0373 10.9306 1.6494 1.9676 1.5681 2.7959 2.7401 6.9863 1.4137 3.0524 2.2479 1.3557 2.0474 1.5802 1.9452 1.9789 2.0096 3.0912 2.7331 2.3652 2.1423 2.4388 3.4793 1.6834 1.3509 1.2745 1.4277 1.2870 1.3551 1.2795 1.2550 1.1080 1.1938 1.0698 1.1439 1.0988 1.1340 1.1960 1.2133 1.1434 1.3813 1.2834 1.6147 1.5723 1.4733 1.4450 1.0519 1.0519 1.0502 1.0504 1.0809 1.0756 1.0706 1.0680 1.0781 1.0922 1.0830 1.0936 1.0973 1.0949 1.0589 1.0590 1.0593 1.0595 1.0597 1.0610 1.0605 1.0550 1.0586 1.0962 1.0982 1.0581 1.1009 1.1009 1.1007 1.1051 1.1067 1.0248 1.0249 1.1067 1.1052 1.1074 1.1078 1.1077 1.1076 1.1076
irintensity: 2.9546 2.3542 1.6987 4.6840 0.7401 0.5759 1.7729 1.0218 3.2890 1.8971 2.0733 3.7920 0.6036 2.6356 11.8690 0.3887 0.0540 0.1096 0.0672 0.2467 1.7432 0.4890 1.8821 1.7870 4.3589 4.6466 0.7042 11.6343 7.9053 17.6256 26.6373 20.6554 13.6333 15.2634 42.2437 5.6685 13.5558 56.8074 43.8891 53.2751 70.4728 11.9727 2.4271 2.1362 6.2191 4.7626 123.9478 17.5480 29.8310 19.6882 12.8324 32.9679 34.8322 91.3770 23.4143 19.9497 32.8609 17.3111 28.5495 5.1946 1.0100 70.2962 71.2300 3.3587 6.4597 1.2117 0.5589 1.3528 8.3834 6.0013 2.9713 18.1529 11.8397 10.7335 2.7868 1.1064 2.6647 0.5115 0.7570 0.5781 3.4187 0.3330 1.6060 1.5143 3.1357 3.9750 0.7240 6.6475 2.2789 0.2514 3.1529 12.5549 12.8715 12.8949 14.0943 11.4129 6.0216 0.0488 0.2065 0.3219 1.9210 4.0020 19.7952 12.5499 11.1912 31.5430 2.7832 0.0539 2.1109 13.8550 46.5209 59.2406 49.0574 35.6565 51.4161 2.0850 1.7571 47.3224 3.7025 2.3910 4.1584 34.3457 26.6201 0.0330 0.1079 62.0090 95.2379 91.1217 0.1364 0.1366 0.0056 0.0101
temp: 298.150 k
press: 1.00000 atm
elementType: 16 16 8 8 8 8 8 8 6 6 6 6 6 6 6 6 6 6 6 6 1 1 1 1 1 1 1 1 1 1 1 1 1 1 1 1 1 1 1 1 1 1 1 1 1 1
symmnumber: 1
zpe: 983428.9 jmol-1
zpe.correction: 0.374568 hartree
zpe.thermalcorrener: 0.402326 hartree
zpe.thermalcorrenthalpy: 0.403271 hartree
zpe.thermalcorrgfe: 0.307605 hartree
zpe.sumelectzpe: -1718.324904 hartree
zpe.sumelectthermal: -1718.297146 hartree
zpe.sumelectthermalent: -1718.296202 hartree
zpe.sumelectthermalfe: -1718.391867 hartree
dipole: 0.9218 3.4481 0.1770
dipole: 3.5735
quadrupole: -200.0588 -127.3389 -145.1176
quadrupole: 14.9196 -38.1924 4.1890
quadrupole: -42.5537 30.1662 12.3875 14.9196 -38.1924 4.1890
hfenergy: -1718.6994721 hartree
pointgroup: C01 [X(C12H26O6S2)]
dipole: 0.3712323 1.3528375 0.0932323 debye
polarizability: 287.5234137|-2.7328173|187.8140964|-1.4118186|-0.3931552|172.2438232 unknown
InChI: InChI=1S/C12H26O6S2/c1-19(13,14)17-11-9-7-5-3-4-6-8-10-12-18-20(2,15)16/h3-12H2,1-2H3
charge 0 multiplicity 1
46 atoms
S  8.290331 0.30458 0.176799
S  -7.863044 0.933836 -0.046463
O  6.538182 0.718434 -0.322859
O  -6.247335 0.116139 0.3977
O  8.741182 -1.096384 -0.500079
O  8.47106 0.516314 1.772515
O  -9.098415 0.024055 0.472048
O  -7.824208 1.427371 -1.588373
C  0.450889 -0.958474 0.184137
C  -0.922853 -0.435777 -0.293209
C  1.63091 -0.076843 -0.282875
C  -2.105879 -1.315902 0.168948
C  3.004603 -0.595019 0.200012
C  -3.477249 -0.783625 -0.302452
C  4.173965 0.298708 -0.280582
C  -4.651286 -1.673847 0.159872
C  5.52796 -0.227849 0.214827
C  -6.029589 -1.179203 -0.302007
C  9.028397 1.769104 -0.774622
C  -7.576714 2.396159 1.125506
H  0.454465 -1.020071 1.292518
H  0.597982 -1.994678 -0.185755
H  -1.07055 0.599572 0.078854
H  -0.925432 -0.37095 -1.401377
H  1.480934 0.960004 0.083449
H  1.629573 -0.019685 -1.391235
H  -2.100043 -1.384356 1.277063
H  -1.960987 -2.350637 -0.207216
H  3.007022 -0.647675 1.308266
H  3.154322 -1.631923 -0.165094
H  -3.630153 0.244631 0.077808
H  -3.484291 -0.713985 -1.410255
H  4.033176 1.33322 0.086016
H  4.185544 0.341026 -1.386335
H  -4.654093 -1.758508 1.263941
H  -4.523304 -2.701571 -0.239134
H  5.726866 -1.2459 -0.172736
H  5.572507 -0.233057 1.32142
H  -6.048833 -1.015084 -1.397336
H  -6.827615 -1.889108 -0.012362
H  8.573447 2.669659 -0.343265
H  10.113432 1.719677 -0.610292
H  8.749925 1.617992 -1.825164
H  -6.653239 2.880825 0.784403
H  -8.459077 3.042244 1.022023
H  -7.481083 1.964763 2.12985
