program: Gaussian 09
title: 000147363
version: EM64L-G09RevD.01
frameworkgroup: C1[X(C12H9NO3)]
method: RPBEPBE
basis: SDD
operation: Freq
keyword: #p
keyword: freq=noraman
keyword: PBEPBE/SDD
title: #p freq=noraman PBEPBE/SDD
converged: YES YES YES YES
title: Mulliken charges:
elementType: O O O N C C C C C C C C C C C C H H H H H H H H H
charge: -0.438321 -0.218573 -0.220933 0.017357 -0.268861 -0.166100 -0.563649 0.400168 0.305646 0.322069 -0.413168 -0.416832 0.247992 -0.379531 -0.405702 -0.205903 0.226128 0.259490 0.235347 0.253753 0.262965 0.304171 0.285284 0.231055 0.346147
chargesum: 0.00000
title: Mulliken charges with hydrogens summed into heavy atoms:
elementType: O O O N C C C C C C C C C C C C
charge: -0.092173 -0.218573 -0.220933 0.017357 -0.042733 -0.166100 -0.068813 0.400168 0.305646 0.322069 -0.159415 -0.153866 0.247992 -0.075361 -0.120418 0.025152
polarizability: 2.19679926e+02 4.78001083e+00 1.81753120e+02 -4.58241938e+00 7.94921147e-01 6.47834336e+01
1716.lowfreq: -5.4244 -1.6324 0.0005 0.0007 0.0009 4.9828 37.0070 47.4067 92.3033
frequency: 36.9902 47.4021 92.3019 167.5981 175.3354 211.0316 249.4892 272.1613 290.7865 312.5821 371.3457 404.6225 459.3315 465.2392 514.3370 523.6865 540.6313 559.6874 583.9643 619.2993 660.0279 684.6648 702.8409 754.2380 777.2350 791.2538 818.7511 834.9942 852.1851 907.0802 935.0241 981.7735 990.7603 1004.0807 1007.9740 1018.7283 1050.3027 1092.7547 1132.7526 1161.6297 1173.1506 1183.4106 1195.1305 1207.8808 1214.4914 1221.7426 1263.9222 1284.0596 1340.2868 1360.0560 1374.2890 1399.1847 1405.9758 1434.5463 1457.7644 1462.6694 1507.5808 1593.1816 1601.7353 1625.5853 2952.4231 2998.5252 3057.0527 3139.8124 3150.9275 3164.9654 3178.2777 3211.4238 3558.4755
redmass: 11.5599 5.3448 4.4097 4.6876 4.1530 5.9110 1.1363 4.3819 4.2875 7.8299 8.9015 4.5410 3.7117 3.2843 5.9863 4.8419 4.3730 5.9784 6.0663 3.5384 4.9706 7.1685 5.9924 5.3760 3.0798 3.1329 2.5114 2.7297 1.4500 3.0340 1.4530 1.7309 2.1481 1.5271 2.9609 3.6310 2.3074 3.1701 2.1528 1.2071 1.2141 1.4489 2.1466 2.3833 1.3641 1.5124 2.1650 1.5015 5.1254 2.0013 2.2051 5.5261 2.6665 1.1819 4.3003 3.3004 4.9028 7.7416 7.5655 8.1841 1.0844 1.0608 1.1016 1.0885 1.0906 1.0956 1.0937 1.0937 1.0665
irintensity: 0.2302 1.2615 0.6430 13.1690 2.8546 2.9969 133.5431 4.7003 4.1707 4.2104 1.6093 3.4411 0.3913 0.0235 1.6519 6.4990 4.5101 0.3130 1.2564 0.3899 9.3496 2.5327 6.0565 14.3700 12.1831 13.5756 50.1210 6.4288 38.9219 33.6376 5.6286 9.7620 6.4447 19.0093 33.4800 35.7339 14.0589 20.3675 7.9340 0.5171 101.8436 38.3571 150.4173 230.2927 29.8604 10.3382 7.5305 1.2931 96.0440 22.1455 3.0326 13.9532 7.7591 18.2562 26.3729 2.9510 37.9129 20.2436 53.5708 16.0513 39.0347 14.6387 13.4343 11.1578 9.0865 12.2149 2.3898 5.9854 4.7954
temp: 298.150 k
press: 1.00000 atm
elementType: 8 8 8 7 6 6 6 6 6 6 6 6 6 6 6 6 1 1 1 1 1 1 1 1 1
symmnumber: 1
zpe: 483144.2 jmol-1
zpe.correction: 0.184020 hartree
zpe.thermalcorrener: 0.196517 hartree
zpe.thermalcorrenthalpy: 0.197462 hartree
zpe.thermalcorrgfe: 0.144426 hartree
zpe.sumelectzpe: -741.906523 hartree
zpe.sumelectthermal: -741.894026 hartree
zpe.sumelectthermalent: -741.893082 hartree
zpe.sumelectthermalfe: -741.946117 hartree
dipole: 6.8813 -2.3776 -1.6385
dipole: 7.4625
quadrupole: -100.3612 -79.3881 -94.4762
quadrupole: -3.4564 -5.1888 -0.5001
quadrupole: -8.9527 12.0204 -3.0677 -3.4564 -5.1888 -0.5001
hfenergy: -742.0905434 hartree
pointgroup: C01 [X(C12H9N1O3)]
dipole: -2.7151163 0.9185832 -0.6358897 debye
dipolederiv: -0.7110239 -0.1586925 0.2144197 -0.2354559 -0.3810687 -0.1286994 0.4103591 -0.1033546 -0.472438 -1.0736243 -0.2272949 -0.015728 -0.3617179 -0.5312126 -0.0003501 -0.0133138 0.0030848 -0.2378381 -0.607091 0.131387 -0.0147353 0.3300382 -0.7340575 0.0254288 -0.022071 0.0197899 -0.2377497 2.1041337 -0.0508759 0.0542594 -0.2613503 1.0226706 -0.0361582 0.0689732 -0.0277407 0.1877662 0.7784868 0.0876084 -0.1516305 0.0673092 0.3086834 0.0332044 -0.3427485 0.0631886 0.4632882 -0.1451998 0.1510876 -0.0060583 0.105155 -0.32644 0.00678 0.0070988 0.0101971 -0.0228308 -0.2521646 -0.0121535 0.0346877 0.0214198 -0.0741423 -0.0283539 0.0869718 -0.073788 0.0762431 0.0383654 0.0050798 0.042058 -0.1257909 0.042189 -0.0174576 0.0899175 -0.0108339 -0.0392676 0.67229 -0.1381317 -0.0006649 0.2065183 0.2264803 0.0107368 -0.0546148 0.0140292 0.0045106 0.0388302 0.0043674 -0.0044815 0.4332826 0.1776866 0.0113266 -0.0181092 -0.0147516 0.0824736 -0.7421616 -0.0342585 -0.0092743 -0.1730959 0.1340453 -0.0064508 0.0100763 -0.0070867 -0.1846585 0.0104792 0.1440647 -0.0030507 0.2339754 -0.1396439 0.0149771 -0.0694903 0.0014633 -0.1426896 -0.7892711 0.1528529 -0.0254541 0.5050324 -0.1437779 0.0173943 -0.0357183 0.012858 0.011229 -0.1922346 -0.1396117 0.0015494 -0.2856283 -0.1381959 -0.0099274 0.008463 -0.0057875 -0.1609625 0.3588273 -0.0564513 0.0122899 -0.5225077 -0.0059002 -0.0175693 0.024805 -0.009628 -0.0725749 0.2070651 -0.0508863 0.0161081 -0.0722255 0.195445 -0.0195709 0.0249765 -0.0268926 -0.1241276 -0.1306067 0.0173097 -0.0699042 -0.014058 0.0266662 -0.0061728 -0.0321771 -0.0142003 -0.1558554 0.0042049 0.0337147 0.0366398 0.0001981 0.0675795 -0.0471199 0.0526285 -0.0812663 -0.012644 -0.0049367 0.0415088 -0.0385394 -0.0074417 -0.0018524 0.0872323 -0.0855427 0.1291284 -0.0033682 0.0745857 0.0316396 -0.0032461 0.026318 -0.0863575 0.0035778 0.0013389 0.0017041 0.1557179 -0.0268925 -0.0880627 -0.0089175 -0.0747231 0.0518836 -0.0000785 -0.0102501 0.0068068 0.153767 0.0735282 0.092552 -0.0069975 0.0116061 0.1023536 0.0036348 -0.0070932 0.0087507 0.1706035 0.0655582 -0.0619504 -0.0007851 -0.0258908 0.1010974 -0.000055 -0.0063872 0.0041392 0.1602188 0.0857491 0.0115072 -0.0019603 0.0061282 -0.1203823 0.011149 0.00097 0.0118584 0.1490791 0.163103 0.1136896 -0.0505842 0.2129047 0.2262508 0.092522 -0.0890624 0.088332 0.2521078 unknown
polarizability: 219.7617312|4.8554193|181.6424931|2.6425336|-3.7656063|64.8122562 unknown
InChI: InChI=1S/C12H9NO3/c14-11-6-7-4-5-10(13(15)16)8-2-1-3-9(11)12(7)8/h1-5,11,14H,6H2
charge 0 multiplicity 1
25 atoms
O  -4.037548 0.054357 0.750208
O  4.086919 0.873667 0.029982
O  3.413182 -1.297185 0.083991
N  3.157022 -0.028398 0.03338
C  -3.035031 0.346728 -0.286803
C  -0.64774 0.096647 -0.106531
C  -2.370884 1.769971 -0.14678
C  -1.873027 -0.628247 -0.148691
C  -0.8722 1.505458 -0.131974
C  0.642263 -0.52597 -0.033068
C  0.227087 2.368385 -0.117252
C  -1.851218 -2.019266 -0.086486
C  1.74627 0.410621 -0.02339
C  0.640808 -1.961089 0.022149
C  1.533624 1.80233 -0.069249
C  -0.575969 -2.66619 0.004188
H  -3.501055 0.244035 -1.290808
H  -2.692463 2.211489 0.816174
H  -2.670535 2.465007 -0.951971
H  0.109503 3.456267 -0.134167
H  -2.774964 -2.605504 -0.093752
H  1.587109 -2.498139 0.08197
H  2.416365 2.447859 -0.059496
H  -0.543557 -3.760285 0.05723
H  -4.88546 0.514553 0.524246
