program: Gaussian 09
title: 000147358
version: EM64L-G09RevD.01
frameworkgroup: C1[X(C6H8N2O3)]
method: RPBEPBE
basis: SDD
operation: Freq
keyword: #pfreq=noraman
keyword: PBEPBE/SDD
title: #p freq=noraman PBEPBE/SDD
converged: YES YES NO NO
title: Mulliken charges:
elementType: O O O N N C C C C C C H H H H H H H H
charge: -0.497891 -0.392057 -0.242255 -0.382041 -0.098041 -0.451513 -0.131814 0.179912 0.153471 -0.218919 -0.324651 0.232839 0.262188 0.269527 0.356206 0.258060 0.251711 0.379623 0.395642
chargesum: 0.00000
title: Mulliken charges with hydrogens summed into heavy atoms:
elementType: O O O N N C C C C C C
charge: -0.118268 0.003586 -0.242255 -0.025835 -0.098041 0.043514 0.137713 0.179912 0.153471 0.039141 -0.072940
polarizability: 1.16239993e+02 -1.08978559e+00 8.58993960e+01 7.58414327e+00 1.33657894e+00 4.88724687e+01
1716.lowfreq: -17.3856 -9.2769 -2.3739 -0.0009 -0.0008 -0.0002 48.8013 66.3641 88.3259
frequency: 48.7834 66.3538 88.3160 119.0989 189.8268 271.8063 303.6884 310.6943 385.2248 410.6172 484.2022 570.3837 609.8570 628.4960 650.5749 699.8079 739.6557 743.1126 804.8289 836.2339 848.8700 907.1147 915.1407 960.3788 999.6391 1036.4355 1073.4010 1087.5078 1089.8519 1155.4569 1194.1286 1221.7771 1263.0555 1272.5205 1298.9028 1325.2502 1350.3979 1386.7529 1397.3330 1445.6211 1460.1916 1526.2809 1638.2733 2985.4584 3029.5345 3090.2521 3227.2069 3257.0644 3466.0760 3510.0703 3518.4303
redmass: 8.6498 5.2713 5.1670 5.3572 5.4263 4.1194 5.3507 4.7472 1.1576 3.3941 3.5296 1.6833 3.2411 3.1158 2.7685 4.8133 4.1632 1.3060 1.1673 3.2419 1.3232 6.4369 2.9417 3.0315 2.9369 3.5118 1.9069 1.9307 1.8740 2.1803 1.2868 1.2498 1.4080 1.8125 1.5636 1.3482 2.9678 2.3576 2.1944 1.0971 4.3286 4.1632 8.9007 1.0672 1.0837 1.0944 1.0916 1.1084 1.0654 1.0834 1.0644
irintensity: 0.7644 2.8400 11.5040 6.8458 2.4211 7.3993 2.5686 13.3561 128.9942 18.3425 17.7584 80.7570 36.7780 8.8891 50.0081 26.2522 8.4777 83.3770 89.6452 33.4307 32.4783 1.2161 10.3514 8.7113 79.0952 147.3027 125.8042 16.2498 33.8430 1.6970 14.3128 20.9308 22.4112 51.6385 86.6498 6.3091 8.7178 7.7551 33.9746 11.3343 2.3281 60.4216 226.0446 20.4420 16.8452 4.7306 3.8929 4.7737 68.1715 133.3204 42.4800
temp: 298.150 k
press: 1.00000 atm
elementType: 8 8 8 7 7 6 6 6 6 6 6 1 1 1 1 1 1 1 1
symmnumber: 1
zpe: 376225.2 jmol-1
zpe.correction: 0.143297 hartree
zpe.thermalcorrener: 0.153506 hartree
zpe.thermalcorrenthalpy: 0.154450 hartree
zpe.thermalcorrgfe: 0.106586 hartree
zpe.sumelectzpe: -567.782598 hartree
zpe.sumelectthermal: -567.772389 hartree
zpe.sumelectthermalent: -567.771445 hartree
zpe.sumelectthermalfe: -567.819309 hartree
dipole: 2.7545 1.3247 -0.2233
dipole: 3.0646
quadrupole: -57.9066 -65.3696 -65.2765
quadrupole: -14.0337 0.2872 0.0963
quadrupole: 4.9443 -2.5187 -2.4257 -14.0337 0.2872 0.0963
hfenergy: -567.9258947 hartree
pointgroup: C01 [X(C6H8N2O3)]
dipole: 1.0698111 -0.0314957 0.5552331 debye
dipolederiv: -0.4826042 -0.1082095 -0.0208727 -0.0911817 -0.509685 0.0494572 -0.1244563 0.0508134 -0.7513983 -0.4343877 -0.2371057 0.2726065 -0.2175151 -0.6066308 0.3209524 0.2968473 0.354834 -0.8905441 -0.8689112 0.195776 -0.2093232 0.1559063 -0.5239791 0.2990181 0.0371509 0.2373287 -0.6393235 -0.3618628 0.0717371 -0.2549935 0.0862145 -0.239656 0.1024301 -0.252888 0.0839822 -0.4694756 -0.4203977 0.0092373 -0.0068756 0.0019789 -0.2738174 0.0334104 -0.0766992 0.0439884 -0.4191259 0.1166926 -0.0127216 -0.0266032 0.0911123 0.1529711 -0.0172032 0.0973404 0.0306618 -0.0272693 -0.2073225 0.0336727 0.1042315 0.1026585 0.385948 -0.0914295 0.0481208 -0.0723879 0.5219728 0.3052328 -0.0477366 0.026061 -0.1921701 0.0079623 -0.1052668 0.0487863 -0.1293425 0.3822569 1.2705752 -0.0997913 -0.0199932 -0.1275989 0.6636158 -0.6196893 -0.3153966 -0.6133713 1.0064947 -0.0103489 -0.0858021 0.1920119 -0.0418071 -0.1774997 -0.0798629 0.0837864 -0.06981 0.0203774 0.1138087 -0.0430361 -0.0210261 -0.035476 -0.1790758 -0.0618362 0.0890087 -0.0668602 0.063961 -0.0823684 0.0648661 0.0157717 0.0845033 -0.0904834 -0.0563626 -0.0280768 -0.0074201 0.0891692 0.0906558 -0.0120135 -0.0050641 -0.0375824 0.0714068 0.0662986 0.0400544 0.0538631 -0.004004 0.0910475 0.0339486 0.0042014 -0.0081275 -0.0862777 0.020394 0.0170519 -0.0050023 0.0240682 0.4412458 0.0225784 0.037398 0.0323204 0.3265249 0.0186062 0.0429522 0.0224455 0.2436919 0.0627353 0.005328 0.0538039 -0.0059875 0.2221734 0.0460333 0.0873243 0.0434792 0.0119967 -0.0517377 0.0331325 -0.0337454 0.0472461 0.1823616 0.0295118 -0.0619272 0.0309904 0.0978756 0.2752569 0.1081495 -0.0976791 0.0460794 0.3116039 0.0183266 0.0252787 -0.0206568 0.3785993 0.1526904 0.0679902 -0.0099096 0.1094268 0.3625372 0.0272117 -0.0542582 0.0324643 0.3606767 unknown
polarizability: 116.8785203|-3.5576883|52.8774349|-1.7820266|-12.432782|81.255902 unknown
InChI: InChI=1S/C6H8N2O3/c9-4(6(10)11)3-5-7-1-2-8-5/h1-2,4,7,9-10H,3H2
charge 0 multiplicity 1
19 atoms
O  0.875975 -0.175304 1.651256
O  2.957288 1.140802 -1.069383
O  3.415218 -0.281881 0.715601
N  -1.761989 -0.222419 0.82594
N  -2.203587 0.351012 -1.316201
C  0.23606 -0.097928 -0.746377
C  1.119003 0.511481 0.377298
C  -1.228999 0.027579 -0.435218
C  2.605969 0.40629 0.048225
C  -3.14538 -0.042672 0.750039
C  -3.400779 0.305065 -0.580391
H  0.523752 -1.159405 -0.883125
H  0.424481 0.429684 -1.696054
H  0.857939 1.578073 0.508012
H  -1.176356 -0.43724 1.639045
H  -3.800635 -0.169287 1.607187
H  -4.356691 0.525909 -1.04919
H  1.714006 -0.648218 1.91134
H  3.929726 1.04506 -1.260001
