program: Gaussian 09
title: 000147339
version: EM64L-G09RevD.01
frameworkgroup: C1[X(C13H11NO)]
method: RPBEPBE
basis: SDD
operation: Freq
keyword: #p
keyword: freq=noraman
keyword: PBEPBE/SDD
title: #p freq=noraman PBEPBE/SDD
converged: YES YES NO YES
title: Mulliken charges:
elementType: O N C C C C C C C C C C C C C H H H H H H H H H H H
charge: -0.292006 -0.014250 -0.094478 -0.281873 -0.458704 0.346239 -0.556451 0.212154 0.237326 -0.392635 -0.081492 -0.350398 -0.307500 -0.193533 -0.371526 0.229073 0.238762 0.216186 0.245731 0.235808 0.217957 0.247641 0.263988 0.234450 0.228050 0.241480
chargesum: 0.00000
title: Mulliken charges with hydrogens summed into heavy atoms:
elementType: O N C C C C C C C C C C C C C
charge: -0.292006 -0.014250 0.134596 -0.043111 0.003213 0.346239 -0.102686 0.212154 0.237326 -0.144994 -0.081492 -0.086410 -0.073050 0.034517 -0.130046
polarizability: 2.12890703e+02 -1.02677902e+01 1.54153272e+02 5.79603336e+00 1.60369089e-01 7.32427347e+01
1716.lowfreq: -7.4923 -0.0004 -0.0001 0.0005 4.8817 11.1832 72.0799 83.5639 141.2135
frequency: 72.0144 83.5502 141.2092 184.6532 220.6662 237.9641 337.7285 366.0108 404.3216 422.7872 439.4537 455.4704 508.3727 540.3707 551.3407 574.8632 636.4408 655.2775 672.9804 697.5871 734.5123 781.2201 812.0650 823.1041 841.5123 852.8684 861.6706 888.8455 936.6067 954.0693 977.2741 980.8260 985.7649 1017.7817 1038.9705 1057.7781 1061.3332 1087.4461 1143.9454 1177.3340 1195.7036 1209.6806 1221.2705 1235.2111 1240.4285 1249.1627 1305.2880 1322.1848 1348.7423 1364.5286 1365.7697 1383.5151 1407.5795 1425.0617 1453.3351 1458.1966 1470.0427 1500.3626 1563.1704 1586.5636 1616.6181 2965.3580 3005.8148 3049.1906 3066.9964 3093.7781 3110.7065 3122.3056 3132.3498 3145.3955 3168.8132 3172.8433
redmass: 4.8649 3.5616 2.7982 5.2778 3.9801 3.5307 3.9791 3.8058 3.9929 4.0818 4.3567 4.2254 4.3403 3.6318 5.0549 6.4460 2.7482 5.6556 5.2464 4.5045 3.0000 1.7432 3.0258 2.9188 4.3587 2.0704 2.3331 2.4906 1.4101 4.5466 2.0316 1.3629 1.3760 1.9224 2.3853 2.0186 1.4488 1.6136 1.3042 1.3759 1.4464 2.0351 1.4824 1.5689 1.5972 1.6952 1.4026 1.6588 2.5995 1.8791 2.5534 2.1440 3.0796 3.3274 1.3451 1.1058 2.1450 3.9458 7.3797 6.0850 7.0829 1.0676 1.0608 1.0913 1.1019 1.0875 1.0949 1.0892 1.0894 1.0886 1.0992 1.0961
irintensity: 1.7908 0.2893 1.7285 3.9157 3.5729 5.5550 2.6861 3.8837 5.7027 7.1360 3.2759 4.7324 0.4578 4.0662 5.2896 5.1799 1.1184 6.0242 0.6240 8.8570 17.4379 9.8487 68.4637 13.8817 2.3011 34.1071 4.5036 8.9573 0.8756 1.2211 6.0857 0.0221 0.3990 1.6439 0.7173 10.3546 0.9571 3.7251 0.3392 3.4816 6.1934 0.8643 2.8981 5.2457 2.5283 0.7671 1.6946 9.4030 10.4330 0.2822 9.1213 5.9761 13.3429 8.6650 13.5224 15.0521 0.8698 14.3828 6.4181 11.1092 3.7660 20.5954 33.4833 25.9085 12.8853 12.0933 66.4906 18.9545 9.4398 12.7172 30.0958 6.4938
temp: 298.150 k
press: 1.00000 atm
elementType: 8 7 6 6 6 6 6 6 6 6 6 6 6 6 6 1 1 1 1 1 1 1 1 1 1 1
symmnumber: 1
zpe: 539360.0 jmol-1
zpe.correction: 0.205431 hartree
zpe.thermalcorrener: 0.216402 hartree
zpe.thermalcorrenthalpy: 0.217346 hartree
zpe.thermalcorrgfe: 0.168590 hartree
zpe.sumelectzpe: -630.880346 hartree
zpe.sumelectthermal: -630.869376 hartree
zpe.sumelectthermalent: -630.868431 hartree
zpe.sumelectthermalfe: -630.917188 hartree
dipole: -0.4079 -3.4143 -2.1387
dipole: 4.0495
quadrupole: -87.9869 -78.0522 -91.0888
quadrupole: -2.9773 7.8630 -2.3466
quadrupole: -2.2776 7.6571 -5.3795 -2.9773 7.8630 -2.3466
hfenergy: -631.0857777 hartree
pointgroup: C01 [X(C13H11N1O1)]
dipole: -0.1452331 -1.3507207 -0.8322834 debye
dipolederiv: -0.7239972 0.1053968 0.0615124 0.0927029 -0.3750389 -0.0699627 0.2739124 -0.1204498 -0.5037166 -0.3308778 0.0262233 -0.0079277 0.0516893 -0.340881 0.0032873 -0.0078808 0.0002054 -0.242447 0.2988728 -0.0723791 0.0890594 0.058989 0.2588599 -0.0210249 0.1435777 0.0819364 0.2012685 0.6309831 -0.097663 0.0381179 -0.1198585 0.151657 -0.0312802 -0.052204 -0.0748099 0.2597855 0.0415873 0.0877032 -0.0159285 0.0676507 0.037784 0.0305941 -0.0665167 0.0490131 0.0690174 0.0216344 0.1235928 -0.0059446 -0.0035825 -0.1287214 0.0187007 -0.1386264 0.030013 -0.0710978 -0.0001236 -0.0432926 0.0068352 -0.0639312 -0.0052413 -0.0061528 -0.0389415 -0.0662949 0.1453892 0.0160233 0.0981246 0.0510947 0.18116 0.1815781 0.0340821 0.0839899 0.0832745 -0.0524548 -0.0089444 -0.1999911 -0.024605 0.0691332 -0.2641961 0.0042515 -0.0166712 -0.0238516 0.0570549 -0.0676262 -0.0884629 0.0141577 -0.019674 0.1381144 -0.000905 -0.0089104 0.0068366 -0.1431645 0.1414487 -0.0254884 0.0175442 -0.3295648 0.1229147 -0.0248643 -0.0016979 -0.005955 0.0597736 -0.1314306 0.0899209 0.0086903 0.0939182 0.0564334 0.0100699 0.0166574 0.016789 -0.1544528 0.1277087 0.0399723 0.0266748 -0.0630513 0.1328398 0.010859 0.0277361 0.0130164 -0.1257784 -0.2826609 -0.1012212 -0.016778 -0.2290801 0.0097211 -0.01254 -0.0185519 -0.0019268 -0.1233967 0.3609422 0.0328295 0.040726 0.2165576 0.1941284 0.0245389 0.0419579 0.0089932 -0.0631572 -0.1198774 -0.012663 -0.1094059 -0.0558381 0.0128825 -0.0266533 -0.1146811 -0.0371026 0.0359308 -0.0457646 0.0242473 -0.0277204 0.0538288 -0.020356 0.1194216 -0.011181 0.0844252 0.0043388 -0.0428004 -0.1062129 -0.0158133 -0.1360956 -0.1227264 -0.0329207 -0.0421002 -0.0694598 0.0830273 0.0636432 0.0309868 -0.0137006 0.0383054 0.0772619 -0.0298585 0.0172396 0.03618 -0.0912605 0.035287 -0.0592615 -0.0108052 -0.061943 0.0101049 -0.0409481 0.005423 -0.0783162 -0.1159213 -0.0020197 0.1197686 -0.0427667 0.0558971 -0.0520559 0.0510994 -0.0282624 0.0834724 0.0503079 0.0271863 0.1097234 -0.013453 0.0756547 -0.0370677 0.0059164 -0.0122208 0.0069789 0.1461587 0.0567627 -0.0865766 -0.0075985 -0.0362884 -0.0181014 -0.0050234 -0.0112091 -0.0087504 0.1562226 0.0831691 -0.0989182 -0.0099234 -0.0529232 -0.0574172 -0.0109248 -0.0097157 -0.0137517 0.1295999 0.0065616 0.095343 -0.0090274 0.1206852 -0.0463474 0.0023241 -0.0087602 0.0007076 0.1617609 -0.1556874 0.0082979 -0.0230144 -0.0043413 0.0838705 -0.002086 -0.0223629 -0.0011729 0.1272112 unknown
polarizability: 213.1625805|-9.4878724|153.9037979|5.5767334|-0.2777537|73.2203312 unknown
InChI: InChI=1S/C13H11NO/c1-2-9-8-4-6-12-13(15-12)10(8)3-5-11(9)14-7-1/h1-3,5,7,12-13H,4,6H2
charge 0 multiplicity 1
26 atoms
O  -3.480165 0.616676 0.868937
N  3.056543 0.991056 0.13765
C  -3.401497 -0.506496 -0.146995
C  -2.635663 0.75223 -0.407201
C  -2.619734 -1.736677 0.306752
C  -1.153567 0.756375 -0.238712
C  -1.192593 -1.781073 -0.299859
C  -0.439757 -0.457073 -0.184028
C  0.997697 -0.414288 -0.065053
C  -0.472699 2.015101 -0.165937
C  1.675856 0.869247 0.017938
C  0.910948 2.076893 -0.032678
C  1.832548 -1.582652 -0.036385
C  3.217443 -1.450107 0.080495
C  3.786013 -0.139898 0.168659
H  -4.347047 -0.667364 -0.679669
H  -3.052093 1.505173 -1.088951
H  -3.163629 -2.658576 0.031601
H  -2.553582 -1.705766 1.409669
H  -1.261654 -2.056654 -1.373103
H  -0.631968 -2.595407 0.191724
H  -1.063468 2.937592 -0.208791
H  1.452104 3.025149 0.030553
H  1.389171 -2.580336 -0.110678
H  3.870578 -2.328048 0.104852
H  4.871315 -0.013477 0.26521
