program: Gaussian 09
title: 000147323
version: EM64L-G09RevD.01
frameworkgroup: C1[X(C10H11NO4)]
method: RPBEPBE
basis: SDD
operation: Freq
keyword: #p
keyword: freq=noraman
keyword: PBEPBE/SDD
title: #p freq=noraman PBEPBE/SDD
converged: NO YES NO NO
title: Mulliken charges:
elementType: O O O O N C C C C C C C C C C H H H H H H H H H H H
charge: -0.267567 -0.241086 -0.205276 -0.205270 0.027133 0.486898 -0.433537 -0.352124 -0.352281 0.376856 -0.352058 -0.352062 -0.478529 0.288706 -0.656916 0.238416 0.238237 0.247749 0.247750 0.288178 0.288199 0.245110 0.245237 0.230383 0.218169 0.229683
chargesum: 0.00000
title: Mulliken charges with hydrogens summed into heavy atoms:
elementType: O O O O N C C C C C C C C C C
charge: -0.267567 -0.241086 -0.205276 -0.205270 0.027133 0.486898 0.043116 -0.104375 -0.104531 0.376856 -0.063880 -0.063862 0.011818 0.288706 0.021319
polarizability: 2.08576869e+02 3.45837475e-01 1.20136107e+02 -1.68468074e+01 7.81750612e-01 8.39904857e+01
1716.lowfreq: -29.6433 -17.9016 -15.4255 -5.7415 -4.2648 -0.0010 -0.0009 -0.0007 19.0827
frequency: -29.4176 -17.7043 18.9340 38.8451 64.0759 119.7308 127.5686 171.0674 197.5857 212.3373 251.9021 298.5593 334.1075 385.6168 406.0714 422.8873 505.4594 522.0043 542.9701 598.2625 627.6673 650.2511 671.8182 733.9635 763.8445 791.6208 814.7463 835.6712 850.2119 891.0799 901.2701 956.5606 985.6586 992.8606 1007.0925 1014.7971 1072.2362 1086.1843 1091.0924 1112.4337 1119.2856 1180.6867 1191.9353 1220.0739 1229.2943 1241.5182 1299.6886 1329.3920 1357.6888 1367.3614 1402.3593 1403.7736 1420.2238 1443.8162 1473.2657 1474.6925 1481.1146 1483.9887 1601.1826 1613.9732 1648.0087 3000.1816 3003.5216 3016.8163 3046.5824 3079.2143 3100.9164 3106.1816 3145.4338 3147.8198 3185.7238 3188.0204
redmass: 1.7753 4.4317 10.0438 6.1372 8.1745 5.6101 3.0153 6.7939 1.4741 3.0588 5.8130 5.0603 2.6826 7.5831 2.8590 4.5360 7.0472 3.7386 2.5642 6.0705 6.8397 4.9295 4.4278 4.7090 6.6172 1.3502 5.8450 2.3427 1.2436 3.3403 4.5281 1.6040 1.3528 1.3782 2.9951 1.8918 3.1014 1.6116 3.3104 1.2768 2.9269 1.3314 1.0887 4.3738 2.9071 1.1758 1.2775 1.5773 1.5747 7.9868 1.2111 7.3730 3.7942 1.0856 1.0388 1.1111 1.0549 2.4902 7.7831 6.4402 9.4689 1.0562 1.0409 1.0578 1.0987 1.1075 1.1004 1.1004 1.0909 1.0911 1.0945 1.0957
irintensity: 0.3105 0.3548 2.6565 1.7108 0.0080 2.1079 6.0400 2.7850 2.8097 0.0798 3.8461 9.1299 1.0485 11.4894 0.0035 4.8950 0.8238 8.3034 0.8404 1.1443 0.4302 0.4946 26.1063 10.7323 30.2919 15.0559 16.8659 60.6243 0.0031 73.9230 8.4684 2.9288 3.3356 0.0092 11.3909 57.8675 185.9487 0.0310 15.9946 14.0924 338.0853 61.8808 0.9945 241.4235 15.4076 0.0131 0.0093 47.7150 7.4075 97.2312 18.1323 5.0084 47.0055 33.6440 12.9885 5.8543 14.8916 1.7431 1.0977 41.8086 201.4317 26.3153 15.0321 17.0814 3.5154 11.2080 26.8574 30.7379 9.8538 4.9487 0.0183 4.1581
temp: 298.150 k
press: 1.00000 atm
elementType: 8 8 8 8 7 6 6 6 6 6 6 6 6 6 6 1 1 1 1 1 1 1 1 1 1 1
symmnumber: 1
zpe: 514829.6 jmol-1
zpe.correction: 0.196088 hartree
zpe.thermalcorrener: 0.209051 hartree
zpe.thermalcorrenthalpy: 0.209995 hartree
zpe.thermalcorrgfe: 0.154329 hartree
zpe.sumelectzpe: -742.125565 hartree
zpe.sumelectthermal: -742.112602 hartree
zpe.sumelectthermalent: -742.111658 hartree
zpe.sumelectthermalfe: -742.167324 hartree
dipole: 4.0598 0.0197 -0.0180
dipole: 4.0599
quadrupole: -118.8677 -80.7367 -88.4397
quadrupole: -0.3156 14.8206 0.1614
quadrupole: -22.8530 15.2780 7.5750 -0.3156 14.8206 0.1614
hfenergy: -742.3216531 hartree
pointgroup: C01 [X(C10H11N1O4)]
dipole: -1.597265 -0.0074317 0.0008144 debye
dipolederiv: -2.0323666 0.0040388 0.12281 0.0052464 -0.2492532 -0.0034634 0.2310565 -0.0037909 -0.481877 -0.9607058 0.0011776 -0.0105912 -0.0047259 -0.2844831 -0.0064457 -0.4673458 -0.0065974 -0.7958456 -0.733201 0.1920795 -0.1208154 0.2199894 -0.6625165 0.0525387 -0.1450886 0.0603791 -0.2617944 -0.7316185 -0.1958941 -0.1143071 -0.2248925 -0.667158 -0.0397475 -0.1376086 -0.0475921 -0.2585707 1.802872 0.0070913 0.3770242 0.0087777 1.090549 -0.0121786 0.4514032 -0.012237 0.2978711 0.3302442 0.0006894 0.0352126 -0.0006111 0.0771306 -0.0026032 -0.0468848 -0.0027605 -0.063886 0.846888 -0.0005253 -0.0563299 -0.0037066 0.3112024 0.0021626 -0.3108921 0.0022439 0.3922208 -0.2668353 0.1760143 -0.0108847 0.1977112 0.0490541 0.0438171 -0.0519394 0.0342124 -0.1323097 -0.2655175 -0.1770357 -0.0049048 -0.2005249 0.0448228 -0.0497216 -0.0456788 -0.0403021 -0.1294429 -0.6953927 -0.0036606 -0.1531641 -0.004809 0.0532114 -0.0010826 -0.2128275 -0.0010825 0.01028 0.1445316 -0.1255778 0.0529459 0.1679614 -0.0435502 0.0422221 0.0788693 -0.0382372 -0.0800625 0.1450149 0.1276814 0.0488818 -0.1646866 -0.0436429 -0.0432687 0.0842205 0.0372174 -0.0798339 -0.0815176 0.0008097 0.0335616 -0.0000468 0.1185063 -0.0006994 0.1217514 -0.0039021 -0.2398408 2.160913 -0.0042509 -0.0991927 0.0025229 0.1723269 0.0099385 0.3834905 0.011033 1.0499047 -0.0156805 0.001015 -0.0161786 0.0012684 0.0697867 -0.0010664 0.0591826 -0.0003879 0.0521476 -0.0238617 0.0199882 -0.0094301 0.0209424 -0.0424282 0.0963008 0.096133 0.0401821 0.0031061 -0.0247523 -0.020198 -0.0084322 -0.0182003 -0.0474736 -0.0950311 0.0964847 -0.0388953 0.0073405 0.0457161 -0.0826011 -0.0372309 -0.0858433 -0.0179927 -0.0153772 -0.0371463 -0.0193371 0.1330344 0.0451121 0.0815399 -0.0400825 0.084863 -0.0161085 0.020254 -0.0401902 0.0242983 0.1316484 0.1038295 0.0580504 -0.0177315 0.0258013 0.0638933 0.0088011 -0.0226714 0.0172664 0.1654493 0.1040897 -0.0583686 -0.0157773 -0.0264279 0.0627989 -0.0054465 -0.0216062 -0.0138077 0.1662823 0.0073861 0.0738604 -0.0020805 0.0712309 -0.0134755 0.0917176 -0.0228068 0.059888 0.0598149 0.0033281 -0.0745797 -0.0042786 -0.0711433 -0.010736 -0.0916527 -0.0251436 -0.0583717 0.0621753 0.0536999 -0.0354363 -0.0222295 -0.0698024 -0.0597262 -0.0855949 -0.0806314 -0.1009178 0.0570843 -0.0173304 0.00177 0.0929743 0.0023891 0.1077567 -0.0018619 0.1434336 -0.0023977 -0.1201545 0.0551546 0.0323224 -0.0197688 0.0667165 -0.0624943 0.0874891 -0.0775637 0.1038967 0.0552583 unknown
polarizability: 208.741068|0.2394872|120.1431673|16.2293046|-0.598064|83.819227 unknown
InChI: InChI=1S/C10H11NO4/c1-2-10(12)15-7-8-3-5-9(6-4-8)11(13)14/h3-6H,2,7H2,1H3
charge 0 multiplicity 1
26 atoms
O  -2.244194 -0.004018 0.14436
O  -4.168635 -0.017176 -1.171197
O  4.733207 -1.124905 0.633229
O  4.728939 1.155487 0.595948
N  4.147646 0.011533 0.451334
C  0.016835 -0.015375 -0.716414
C  -1.437124 -0.02427 -1.120031
C  0.709599 -1.234297 -0.501085
C  0.705287 1.212519 -0.542031
C  2.717316 0.002325 0.050593
C  2.063387 -1.237582 -0.115416
C  2.058995 1.233678 -0.156747
C  -4.347166 0.015481 1.306741
C  -3.639646 -0.003741 -0.038045
C  -5.879491 0.036621 1.172505
H  -1.71372 0.859395 -1.721726
H  -1.711366 -0.928444 -1.691613
H  0.182501 -2.185276 -0.634269
H  0.174781 2.156599 -0.707077
H  2.616916 -2.164198 0.0551
H  2.609152 2.167495 -0.017506
H  -4.00584 -0.867414 1.880545
H  -3.979441 0.893904 1.870613
H  -6.241354 -0.848787 0.623188
H  -6.35083 0.046099 2.170574
H  -6.216753 0.928748 0.618325
